program: Gaussian 09
title: 000295785
version: EM64L-G09RevD.01
frameworkgroup: C1[X(C19H18N4O2)]
method: RPBEPBE
basis: SDD
operation: Freq
keyword: #p
keyword: freq=noraman
keyword: PBEPBE/SDD
title: #p freq=noraman PBEPBE/SDD
converged: YES YES NO NO
title: Mulliken charges:
elementType: O O N N N N C C C C C C C C C C C C C C C C C C C H H H H H H H H H H H H H H H H H H
charge: -0.284095 -0.328331 -0.468812 -0.407220 -0.133293 -0.089053 0.199343 0.012532 0.428712 0.000109 0.436312 -0.361656 -0.446638 -0.323092 0.233777 -0.444796 -0.313697 -0.200733 -0.227408 -0.258329 -0.199660 -0.226607 -0.219264 -0.259444 -0.672893 0.373090 0.333881 0.278690 0.240260 0.294979 0.227287 0.301573 0.226865 0.227264 0.228522 0.227551 0.228816 0.230283 0.229810 0.229328 0.213538 0.231210 0.231290
chargesum: 0.00000
title: Mulliken charges with hydrogens summed into heavy atoms:
elementType: O O N N N N C C C C C C C C C C C C C C C C C C C
charge: -0.284095 -0.328331 -0.095722 -0.073340 -0.133293 -0.089053 0.199343 0.012532 0.428712 0.000109 0.436312 -0.082967 -0.206379 -0.028113 0.233777 -0.217510 -0.012124 0.026132 -0.000143 -0.029807 0.027891 0.002210 0.240829 -0.030116 0.003146
polarizability: 4.24403746e+02 -7.16996074e-01 3.21429231e+02 8.73497409e+00 -1.59710597e+01 1.09097636e+02
1716.lowfreq: -5.4757 -3.6373 -0.0007 -0.0005 0.0001 5.3733 24.2847 26.8576 33.6097
frequency: 24.2766 26.8449 33.5884 40.6844 56.2767 72.9194 81.0156 93.5285 112.0596 115.3649 125.1895 191.9125 201.0085 221.7721 234.3545 243.6174 259.6946 275.1061 308.5438 320.7313 341.2784 370.2871 405.7537 412.7888 425.8562 450.7188 501.3107 509.3773 512.2296 574.6170 610.8550 613.5542 624.2018 655.7573 662.2973 686.3306 687.1173 693.9256 701.0699 727.1653 748.7684 765.9029 768.3932 786.3660 789.5690 799.4068 834.3129 836.4985 845.7445 848.9768 877.6682 895.7928 913.5387 925.3462 959.8941 970.0048 976.4827 978.2338 985.4873 986.5171 990.7675 1007.4263 1020.4711 1025.1877 1027.4934 1061.1708 1087.5293 1090.7947 1112.7118 1135.9177 1169.9871 1171.8677 1184.2793 1187.5392 1191.5814 1205.4191 1245.5833 1250.1309 1262.1858 1292.0102 1321.3889 1325.3032 1339.7796 1369.1935 1382.4095 1384.4753 1401.7969 1404.4324 1428.0555 1439.8112 1444.5730 1463.8711 1473.6982 1477.9510 1483.6678 1487.3408 1501.7745 1526.1036 1545.0486 1578.2316 1586.7967 1601.1940 1615.3745 1616.3842 1646.4346 2996.8375 3012.1034 3070.9825 3093.7294 3108.8796 3115.6473 3121.6631 3130.4475 3131.4407 3144.2202 3144.5052 3164.6552 3165.4016 3165.9762 3199.5744 3204.5750 3206.4146 3514.0188
redmass: 4.6876 3.7338 3.6062 4.8413 3.1490 4.1416 4.8908 3.4678 8.1387 5.0317 3.6659 5.7450 5.8452 4.9399 3.4345 1.7357 3.1173 5.2095 6.5380 5.9966 7.3097 3.9712 2.9007 3.0120 7.4766 3.5974 6.9167 2.9458 3.1232 7.8144 6.5086 6.4096 6.8641 5.4912 5.4934 5.4947 2.0794 2.0169 2.1297 3.3154 3.9148 1.7404 2.0294 4.6953 6.8464 1.1099 3.7334 1.3733 3.4325 1.3769 4.4064 1.2713 1.4042 1.3984 1.4239 1.3672 1.4112 6.3748 5.1478 4.4798 1.3548 1.3524 2.4266 2.1243 2.0618 4.7470 1.5691 1.7689 2.2181 1.4587 1.0673 1.0536 1.1510 1.4527 2.1508 3.7990 2.6770 1.1348 2.5605 2.0723 1.4453 1.4760 2.1528 1.8066 6.0372 5.0217 1.3265 4.5657 2.8921 2.6914 2.6538 1.0400 1.0727 2.8373 2.3368 1.0905 2.6185 3.6394 6.2274 5.9431 6.3971 4.5797 5.9868 6.3697 1.8044 1.0358 1.0581 1.1067 1.0985 1.1028 1.0881 1.0869 1.0880 1.0872 1.0939 1.0938 1.1002 1.1000 1.0930 1.0943 1.0930 1.0824 1.0749
irintensity: 0.4766 0.2150 0.1007 0.0887 0.9350 0.6177 0.3297 0.3799 0.0954 0.4443 2.7248 1.9027 4.5067 0.8457 0.8606 1.7123 1.7465 3.3296 6.9054 1.6489 19.0803 7.5151 0.2496 0.0861 6.8674 0.3506 12.1015 29.7839 8.6143 14.8078 1.1560 2.8268 2.3358 1.1058 13.3922 7.2230 8.9997 95.2637 3.3435 5.7656 4.9355 142.7128 1.4793 39.2283 13.6904 2.4455 12.4325 1.6899 4.8392 6.5177 10.0896 39.1742 65.9980 12.5345 10.7493 0.8767 0.1424 4.3713 1.8609 0.4358 2.9824 1.5037 14.0527 23.8659 10.0987 457.1526 2.9802 112.8423 1.0640 5.6454 3.2778 0.0770 14.7639 90.3602 100.3324 68.5055 5.3310 0.1330 304.8440 364.3599 7.3135 0.8385 13.1821 28.1575 49.7333 5.6402 37.1087 236.1216 177.2323 161.2442 55.2338 12.4799 11.1145 76.9575 111.2768 17.6488 3.4694 1200.8064 191.1938 544.6295 287.2779 55.5570 90.8523 19.9994 295.0491 25.0657 21.9492 7.3523 31.0748 43.3355 10.4825 6.2390 3.1603 0.0859 37.7071 16.1483 32.3838 34.5493 2.1887 10.2584 17.6102 212.8435 59.7180
temp: 298.150 k
press: 1.00000 atm
elementType: 8 8 7 7 7 7 6 6 6 6 6 6 6 6 6 6 6 6 6 6 6 6 6 6 6 1 1 1 1 1 1 1 1 1 1 1 1 1 1 1 1 1 1
symmnumber: 1
zpe: 884962.0 jmol-1
zpe.correction: 0.337064 hartree
zpe.thermalcorrener: 0.358839 hartree
zpe.thermalcorrenthalpy: 0.359784 hartree
zpe.thermalcorrgfe: 0.283711 hartree
zpe.sumelectzpe: -1102.555597 hartree
zpe.sumelectthermal: -1102.533822 hartree
zpe.sumelectthermalent: -1102.532878 hartree
zpe.sumelectthermalfe: -1102.608950 hartree
dipole: -0.9524 -0.5672 -0.0009
dipole: 1.1084
quadrupole: -113.6322 -134.3845 -151.2327
quadrupole: 1.7097 2.5285 -3.4336
quadrupole: 19.4509 -1.3013 -18.1496 1.7097 2.5285 -3.4336
hfenergy: -1102.8926613 hartree
pointgroup: C01 [X(C19H18N4O2)]
dipole: -0.3662107 0.2367023 0.006274 debye
polarizability: 423.6059537|-3.7110396|320.959906|-17.5874475|-18.9411919|110.364754 unknown
InChI: InChI=1S/C19H18N4O2/c1-2-25-18(24)16-13-20-19(22-15-11-7-4-8-12-15)23-17(16)21-14-9-5-3-6-10-14/h3-13,21-22H,2H2,1H3
charge 0 multiplicity 1
43 atoms
O  -4.46134 1.373532 0.155248
O  -3.832102 -0.863975 0.305868
N  -1.203305 -1.396878 0.121221
N  1.682286 2.392933 -0.130573
N  0.289217 0.45496 -0.012447
N  -0.590561 2.749052 -0.130058
C  -0.987496 -0.041997 0.055946
C  -2.130975 0.857497 0.071252
C  -0.300076 -2.491772 0.04185
C  0.433003 1.805474 -0.083381
C  2.990518 1.854958 -0.028941
C  -1.839873 2.243829 -0.043753
C  -0.801175 -3.754315 0.466878
C  1.019475 -2.404619 -0.475859
C  -3.503564 0.364262 0.185758
C  4.070918 2.733651 -0.323361
C  3.264008 0.522022 0.377614
C  0.004746 -4.906729 0.382938
C  1.815998 -3.567539 -0.55285
C  1.322861 -4.821329 -0.124487
C  5.402096 2.285463 -0.217025
C  4.603149 0.088182 0.478387
C  -5.885954 0.93293 0.272824
C  5.678976 0.956473 0.182429
C  -6.73815 2.196315 0.218682
H  -2.211481 -1.627668 0.240707
H  1.60889 3.408564 -0.244929
H  -2.664061 2.962254 -0.065025
H  -1.821592 -3.824632 0.863124
H  1.399636 -1.442181 -0.818456
H  3.864159 3.764721 -0.637696
H  2.435347 -0.145592 0.615244
H  -0.396313 -5.870591 0.715309
H  2.830413 -3.488996 -0.960628
H  1.950426 -5.716558 -0.189005
H  6.222566 2.97384 -0.447796
H  4.802852 -0.940517 0.799563
H  -6.10321 0.236726 -0.557065
H  -6.001173 0.382207 1.223655
H  6.713711 0.607608 0.264471
H  -7.806886 1.92751 0.302839
H  -6.485499 2.878845 1.047906
H  -6.589262 2.732982 -0.733776
