program: Gaussian 09
title: 000295796
version: EM64L-G09RevD.01
frameworkgroup: C1[X(C16H19N3O2S)]
method: RPBEPBE
basis: SDD
operation: Freq
keyword: #p
keyword: freq=noraman
keyword: PBEPBE/SDD
title: #p freq=noraman PBEPBE/SDD
converged: YES YES NO NO
title: Mulliken charges:
elementType: S O O N N N C C C C C C C C C C C C C C C C H H H H H H H H H H H H H H H H H H H
charge: 0.288087 -0.283526 -0.317556 -0.376749 -0.023159 0.028454 -0.555998 0.518642 -0.497227 0.447891 0.225721 -0.466945 0.037380 -0.430731 -0.206113 -0.812975 -0.361645 0.225425 -0.408475 -0.256165 -0.665524 -0.828120 0.264441 0.228720 0.365500 0.245411 0.232310 0.233144 0.225036 0.230706 0.234592 0.222775 0.283314 0.235791 0.225165 0.218945 0.229608 0.248877 0.273961 0.276562 0.244448
chargesum: 0.00000
title: Mulliken charges with hydrogens summed into heavy atoms:
elementType: S O O N N N C C C C C C C C C C C C C C C C
charge: 0.288087 -0.283526 -0.317556 -0.011249 -0.023159 0.028454 -0.062837 0.518642 -0.251817 0.447891 0.225721 -0.234635 0.037380 -0.197586 0.018924 -0.124902 -0.078330 0.225425 -0.408475 0.204791 0.031907 -0.033149
polarizability: 2.63972093e+02 3.24554607e+00 2.71285612e+02 -2.37833082e+01 7.86483237e+00 1.73753862e+02
1716.lowfreq: -38.4582 -8.0318 -5.5421 -0.0018 -0.0011 -0.0007 2.0658 5.6152 16.8022
frequency: -38.4241 3.3288 16.7008 26.7751 33.9914 39.8058 70.6660 93.8306 103.3810 110.1333 116.9322 126.9764 149.4872 182.2966 195.7336 210.4129 215.7139 245.8286 259.0705 271.3691 299.7555 336.6592 351.3617 357.1973 410.5811 427.0426 437.5035 449.1848 486.4204 510.6410 520.6278 547.8255 606.0260 623.0965 649.5955 663.0812 699.9996 706.1656 707.4633 730.2963 750.4374 781.5039 789.6555 814.2167 826.2938 833.4864 888.2798 901.3112 911.0989 922.4988 954.6408 976.9746 981.9354 984.3229 987.7204 990.6513 1002.3524 1018.7750 1030.1709 1049.6503 1078.2993 1094.6728 1103.6917 1137.7317 1155.0020 1163.6559 1183.4463 1198.5227 1246.3133 1263.9529 1277.8262 1286.6469 1306.1887 1307.6875 1336.5404 1347.3542 1357.2840 1368.2486 1381.2209 1389.9881 1397.8697 1409.7294 1427.8146 1434.8408 1437.9376 1452.3547 1456.6677 1462.3473 1469.7357 1470.8638 1473.5278 1484.0095 1486.5530 1529.2854 1581.9593 1594.6643 1601.8254 1619.6724 2977.4766 2990.1237 2993.5419 3021.6285 3032.5726 3055.1703 3056.6439 3085.2224 3088.8119 3094.9530 3115.3722 3120.2663 3120.8736 3126.0211 3146.2020 3150.6464 3152.4624 3166.8534 3342.6754
redmass: 1.0218 4.3116 4.2843 4.7396 3.0246 3.6967 4.5686 6.2450 2.4587 3.7778 1.3906 3.1961 6.7461 3.4440 3.3569 1.8503 2.3551 3.3938 4.0928 5.3059 3.7295 5.4748 4.8581 3.7506 3.2384 2.8640 3.7759 3.1812 8.8943 4.0663 4.7959 7.4311 4.6988 5.2162 10.6499 7.1721 5.4930 4.3072 3.4964 4.0141 3.3300 3.8617 1.4739 1.4004 3.6792 1.3639 2.5789 1.3331 1.9266 2.2558 1.4502 1.1808 1.3674 3.1144 2.2691 2.0195 1.7708 2.1017 4.4615 1.5766 4.4955 2.1688 1.7040 5.3102 1.6752 1.7197 1.0895 3.0841 1.5089 2.4200 1.1771 1.7718 1.5762 3.4144 1.3168 1.4671 1.4386 2.3103 5.2919 1.2387 1.2657 2.4206 3.3697 1.0563 2.4766 1.1122 1.1165 1.0454 1.0859 1.1083 1.5091 1.0541 1.6179 6.2374 4.0817 3.8499 5.3104 6.1511 1.0374 1.0628 1.0362 1.0282 1.0592 1.0982 1.0972 1.0990 1.0972 1.1033 1.0866 1.0909 1.1063 1.0915 1.1040 1.1055 1.0992 1.0929 1.0804
irintensity: 0.4968 0.0799 0.2769 0.2242 0.2207 1.9442 0.1334 0.7793 0.9352 1.6464 0.8651 0.2299 1.6984 0.1663 2.0932 5.2863 0.5750 2.7142 3.5965 4.3228 12.7496 4.1519 19.6453 1.4300 13.8064 5.3330 5.4017 9.3129 18.4914 3.2093 0.7230 5.9483 5.8537 1.8800 0.9937 0.7301 9.1823 9.2386 9.1839 3.4929 5.2562 0.5626 38.7570 2.3256 12.6655 131.8972 33.2650 3.0042 15.5535 0.8193 6.6742 7.8281 0.3006 0.8900 1.4395 1.3183 4.7324 23.8807 108.3714 11.0330 158.0324 46.8011 10.0367 612.8459 39.9640 10.7258 1.9027 36.5746 16.2053 3.6766 72.1519 252.1862 3.7449 0.7968 93.7388 18.0667 84.5041 150.1209 8.2673 29.4497 11.0033 127.4286 24.2960 15.2409 19.6813 17.4206 7.9846 15.7617 37.7087 9.5814 16.2647 10.1709 13.6960 223.7505 619.7307 427.0986 47.8985 18.0028 29.2084 43.2127 22.9250 20.0646 34.7085 10.8655 18.4258 20.8505 38.9793 0.8777 1.6964 16.1534 30.3982 25.7849 13.2303 12.0709 32.4309 2.3777 150.5308
temp: 298.150 k
press: 1.00000 atm
elementType: 16 8 8 7 7 7 6 6 6 6 6 6 6 6 6 6 6 6 6 6 6 6 1 1 1 1 1 1 1 1 1 1 1 1 1 1 1 1 1 1 1
symmnumber: 1
zpe: 849362.9 jmol-1
zpe.correction: 0.323505 hartree
zpe.thermalcorrener: 0.345403 hartree
zpe.thermalcorrenthalpy: 0.346347 hartree
zpe.thermalcorrgfe: 0.267112 hartree
zpe.sumelectzpe: -1332.278184 hartree
zpe.sumelectthermal: -1332.256287 hartree
zpe.sumelectthermalent: -1332.255343 hartree
zpe.sumelectthermalfe: -1332.334578 hartree
dipole: 1.6989 -2.7687 -0.8544
dipole: 3.3589
quadrupole: -125.9099 -137.5551 -130.6058
quadrupole: 17.0992 0.9929 -6.4222
quadrupole: 5.4470 -6.1982 0.7512 17.0992 0.9929 -6.4222
hfenergy: -1332.6016894 hartree
pointgroup: C01 [X(C16H19N3O2S1)]
dipole: -0.9456454 0.6871599 -0.6163378 debye
polarizability: 251.0704609|5.0948495|271.1892416|38.7554267|-10.7587715|186.7518642 unknown
InChI: InChI=1S/C16H19N3O2S/c1-4-21-15(20)13-10-18-16(22-3)19-14(13)17-9-12-7-5-6-11(2)8-12/h5-8,10,17H,4,9H2,1-3H3
charge 0 multiplicity 1
41 atoms
S  2.583617 -3.608738 1.3611
O  2.654677 3.027472 0.856135
O  0.792979 2.705644 -0.515029
N  -0.013222 0.141748 -0.908642
N  1.234646 -1.542801 0.170221
N  3.164304 -1.009029 1.573965
C  -0.924674 -0.821214 -1.546636
C  -2.380119 -0.649894 -1.117456
C  -2.72044 -0.543145 0.252444
C  -4.068828 -0.427989 0.673751
C  1.026242 -0.205923 -0.09711
C  -3.411231 -0.636446 -2.088132
C  1.90673 0.792189 0.483622
C  -5.086918 -0.425388 -0.314536
C  -4.760479 -0.527672 -1.685494
C  -4.410646 -0.301002 2.148967
C  2.954132 0.30622 1.308946
C  1.716046 2.221907 0.216592
C  2.269261 -1.866985 0.974136
C  2.553159 4.500173 0.612109
C  3.30922 4.892376 -0.660063
C  1.204969 -4.440099 0.391085
H  -0.555634 -1.826727 -1.277347
H  -0.849421 -0.718349 -2.646662
H  -0.133953 1.158008 -1.056257
H  -1.91952 -0.547207 1.003077
H  -3.159835 -0.710597 -3.153554
H  -6.136336 -0.338665 -0.008076
H  -5.557022 -0.518265 -2.438077
H  -3.930869 -1.098889 2.745286
H  -4.059389 0.665321 2.55853
H  -5.499606 -0.359351 2.317886
H  3.647563 1.015659 1.76925
H  1.48557 4.772632 0.546257
H  3.005361 4.939438 1.515564
H  3.298601 5.992404 -0.773599
H  4.360654 4.560622 -0.612262
H  2.833262 4.450218 -1.551119
H  1.317594 -4.219753 -0.679749
H  0.229231 -4.080566 0.746843
H  1.319122 -5.518442 0.582937
