program: Gaussian 09
title: 000295761
version: EM64L-G09RevD.01
frameworkgroup: C1[X(C14H17N5O2)]
method: RPBEPBE
basis: SDD
operation: Freq
keyword: #p
keyword: freq=noraman
keyword: PBEPBE/SDD
title: #p freq=noraman PBEPBE/SDD
converged: YES YES NO NO
title: Mulliken charges:
elementType: O O N N N N N C C C C C C C C C C C C C C H H H H H H H H H H H H H H H H H
charge: -0.287182 -0.322777 -0.384944 -0.129396 -0.066669 -0.336956 -0.507702 -0.540500 0.499382 0.219062 0.037591 -0.445892 -0.367519 -0.348897 0.230147 -0.217669 -0.230189 -0.025141 -0.242629 -0.219376 -0.673817 0.226820 0.263698 0.365143 0.229969 0.245535 0.275390 0.226043 0.226054 0.229013 0.228930 0.227559 0.342297 0.211905 0.230493 0.230476 0.301726 0.300022
chargesum: 0.00000
title: Mulliken charges with hydrogens summed into heavy atoms:
elementType: O O N N N N N C C C C C C C C C C C C C C
charge: -0.287182 -0.322777 -0.019801 -0.129396 -0.066669 0.005342 0.094045 -0.049982 0.499382 0.219062 0.037591 -0.215923 -0.121984 -0.073507 0.230147 0.008374 -0.004135 -0.025141 -0.013616 0.237113 -0.000943
polarizability: 2.50072276e+02 5.30690478e+00 2.27986768e+02 1.44473129e+01 8.04710626e+00 1.44823035e+02
1716.lowfreq: -6.8450 -0.0007 -0.0006 -0.0003 0.8529 4.4224 8.9277 20.8588 22.8471
frequency: 8.0304 20.7891 22.8164 41.0942 52.1398 86.9940 94.0268 110.7449 130.9053 135.1457 165.3447 184.7694 190.3258 220.0532 232.8582 243.0790 271.0953 285.8628 299.5547 344.2363 372.2511 404.1955 430.0858 455.7547 463.6599 512.4238 561.9691 580.4395 595.3050 609.2371 617.2227 669.1688 672.8414 704.2258 725.2859 727.1312 750.5926 784.4603 784.7213 795.7308 798.3225 803.9803 840.2275 842.0379 856.3024 908.1754 950.5735 960.8724 977.4051 990.2871 995.3702 1004.0112 1025.3918 1029.9888 1060.2527 1079.5360 1095.6400 1112.5500 1135.7593 1172.1057 1175.3610 1187.1889 1210.7110 1213.3128 1246.0064 1247.5444 1268.9066 1286.4243 1290.4642 1314.3751 1334.1067 1350.0029 1366.5859 1385.9521 1397.8619 1400.1900 1416.9223 1441.5045 1461.2836 1462.8967 1474.0305 1474.8826 1485.4925 1487.1090 1503.0030 1551.0095 1585.8021 1597.1332 1601.4003 1615.5517 1681.0753 2986.8154 2995.8878 3010.4227 3050.2978 3068.6611 3092.7653 3107.6238 3114.0605 3124.5366 3136.5015 3147.2184 3162.9144 3163.5728 3334.1394 3391.7429 3505.7516 3570.0059
redmass: 4.3881 4.3816 3.4492 3.8000 3.5936 4.4115 4.8185 3.3201 4.0905 1.9676 4.6748 3.3259 1.8330 4.4028 3.9694 1.2653 4.2933 5.2535 6.2045 3.4238 7.1759 2.8145 3.4626 3.6745 3.7947 5.2431 5.8478 4.5641 1.1021 5.5801 6.2024 5.8504 9.8988 1.8871 3.0735 7.9940 1.8124 4.6870 5.4702 2.3165 1.1142 3.2115 1.4766 3.2934 1.2508 1.4212 2.7578 1.4277 1.3891 6.1918 1.3677 2.9824 2.3205 2.6559 4.2382 2.4253 2.5686 2.2132 1.4590 1.0570 4.5896 1.1110 2.6714 3.0324 1.4618 1.1366 2.4640 1.1558 1.7995 1.3469 2.6472 1.3878 1.7053 5.9120 2.5788 1.3746 2.0656 2.1133 1.2736 1.0404 1.1296 1.8530 2.0793 1.0877 6.1446 7.1219 4.2283 5.7206 3.7379 5.9224 1.0645 1.0623 1.0358 1.0581 1.0984 1.1066 1.0985 1.1026 1.0874 1.0859 1.0912 1.0960 1.0929 1.1015 1.0809 1.0425 1.0991 1.0787
irintensity: 0.0448 0.2539 0.3105 0.0487 0.6750 1.7269 0.7701 1.2714 0.7623 2.5042 0.3417 7.7384 28.4108 3.6018 4.7155 0.1251 1.1653 9.0775 4.8851 6.7299 15.2171 0.6709 8.0935 0.2062 1.2595 34.0274 11.0253 36.4255 169.5424 0.5417 1.7718 13.3680 0.2576 48.3432 20.9788 0.7580 55.6714 1.5865 40.0208 117.0242 4.5709 4.9232 101.9926 26.1571 19.7147 2.6997 9.5787 7.7613 0.1726 0.2440 1.8957 13.9184 14.1291 86.0394 115.8180 174.1459 140.2477 1.2452 5.4875 0.1249 10.2949 2.2486 3.7269 144.3010 69.5296 0.1820 194.9729 0.1159 201.8173 4.7464 31.8992 15.1463 10.6320 16.5335 111.1683 23.7708 91.9132 21.5010 49.0154 12.2355 19.4017 33.4920 23.2817 26.5216 369.6131 290.3856 510.1231 94.5145 564.4150 15.1655 25.8068 49.1365 23.2795 22.0302 12.5312 8.0650 30.8521 43.9584 9.1823 0.8232 15.2576 43.1980 3.8864 22.7438 154.8824 0.2927 1.1432 117.4262
temp: 298.150 k
press: 1.00000 atm
elementType: 8 8 7 7 7 7 7 6 6 6 6 6 6 6 6 6 6 6 6 6 6 1 1 1 1 1 1 1 1 1 1 1 1 1 1 1 1 1
symmnumber: 1
zpe: 792360.7 jmol-1
zpe.correction: 0.301794 hartree
zpe.thermalcorrener: 0.322092 hartree
zpe.thermalcorrenthalpy: 0.323036 hartree
zpe.thermalcorrgfe: 0.248713 hartree
zpe.sumelectzpe: -966.363665 hartree
zpe.sumelectthermal: -966.343367 hartree
zpe.sumelectthermalent: -966.342423 hartree
zpe.sumelectthermalfe: -966.416746 hartree
dipole: -0.6340 -1.3677 -0.4407
dipole: 1.5706
quadrupole: -108.3386 -126.0187 -116.4199
quadrupole: -7.2512 1.8666 -3.6274
quadrupole: 8.5871 -9.0930 0.5058 -7.2512 1.8666 -3.6274
hfenergy: -966.6654596 hartree
pointgroup: C01 [X(C14H17N5O2)]
dipole: -0.4383643 0.3751108 0.2212916 debye
polarizability: 248.8557015|6.25596|226.9818634|-20.3158207|7.5945443|147.0445139 unknown
InChI: InChI=1S/C14H17N5O2/c1-2-21-13(20)11-9-17-14(19-15)18-12(11)16-8-10-6-4-3-5-7-10/h3-7,9,16,19H,2,8,15H2,1H3
charge 0 multiplicity 1
38 atoms
O  2.76269 2.674592 0.039317
O  0.610779 2.497473 0.917736
N  -0.473909 0.010504 1.016618
N  0.841195 -1.766396 0.20688
N  3.105851 -1.37734 -0.682105
N  2.18309 -3.51325 -0.611142
N  1.216481 -4.51179 -0.356716
C  -1.590342 -0.873558 1.378345
C  -2.868738 -0.587017 0.592947
C  0.696674 -0.423592 0.462278
C  1.768637 0.505537 0.145409
C  -4.122839 -0.565184 1.250649
C  -2.82544 -0.376638 -0.808754
C  2.94218 -0.059396 -0.425198
C  1.635799 1.937718 0.407008
C  -5.315136 -0.346624 0.522535
C  -4.013852 -0.154856 -1.537815
C  2.017092 -2.170797 -0.343135
C  -5.264197 -0.141049 -0.874944
C  2.690424 4.146944 0.283591
C  4.004477 4.736962 -0.217712
H  -1.794293 -0.781595 2.463031
H  -1.244426 -1.905407 1.187845
H  -0.533633 1.031577 1.17092
H  -4.168186 -0.716411 2.33683
H  -1.857499 -0.381448 -1.32303
H  3.778706 0.598009 -0.679884
H  -6.27846 -0.329973 1.044782
H  -3.967196 0.00778 -2.62065
H  -6.186433 0.033165 -1.440417
H  1.81203 4.547326 -0.254004
H  2.53575 4.31281 1.365124
H  3.068435 -3.807626 -1.024469
H  4.007183 5.830622 -0.057674
H  4.86347 4.304694 0.323386
H  4.137966 4.543422 -1.295777
H  0.356776 -4.33542 -0.895671
H  1.003996 -4.567973 0.649366
