program: Gaussian 09
title: 000027321
version: EM64L-G09RevD.01
frameworkgroup: C1[X(C21H26ClNO2)]
method: RPBEPBE
basis: SDD
operation: Freq
keyword: #p
keyword: freq=noraman
keyword: PBEPBE/SDD
title: #p freq=noraman PBEPBE/SDD
converged: YES YES NO NO
title: Mulliken charges:
elementType: Cl O O N C C C C C C C C C C C C C C C C C C C C C H H H H H H H H H H H H H H H H H H H H H H H H H H
charge: -0.071758 -0.266848 -0.276709 -0.094976 -0.398455 0.371689 0.353891 -0.541639 -0.618883 0.293301 0.390661 -0.399575 -0.443809 -0.338453 -0.442420 -0.253042 -0.118014 -0.243724 -0.263041 -0.235642 -0.249594 -0.244965 -0.363839 -0.613881 -0.612971 0.199775 0.225509 0.233130 0.200851 0.290089 0.253459 0.231645 0.237416 0.236385 0.178683 0.225494 0.227574 0.255152 0.225938 0.179201 0.205209 0.182385 0.209654 0.220414 0.195508 0.188700 0.220599 0.223622 0.227949 0.187613 0.220740
chargesum: 0.00000
title: Mulliken charges with hydrogens summed into heavy atoms:
elementType: Cl O O N C C C C C C C C C C C C C C C C C C C C C
charge: -0.071758 -0.266848 -0.276709 -0.094976 -0.198680 0.371689 0.353891 -0.083000 -0.127943 0.293301 0.390661 -0.146116 -0.212164 -0.101037 -0.206035 0.151135 -0.118014 -0.016150 -0.007888 -0.009704 0.134816 0.147074 0.052083 0.019040 0.023333
polarizability: 2.61197238e+02 3.50819146e+01 2.51295253e+02 2.72077198e+01 -5.01608651e+00 2.30444291e+02
1716.lowfreq: -18.0296 -7.6287 -6.9348 -3.3817 0.0019 0.0021 0.0024 8.9565 13.9091
frequency: -17.1617 8.0817 13.8302 26.3182 49.4251 58.5530 70.3050 77.1411 92.5507 111.5414 120.7558 132.3441 138.6771 171.3460 196.8378 213.1389 223.6261 227.8430 244.6845 258.2108 277.1374 296.5296 313.5564 316.7043 338.2641 347.7844 353.9261 382.2557 382.9098 434.0508 446.5709 456.7186 458.8663 489.2253 526.6549 548.6291 576.7688 594.3275 607.6061 634.0412 672.4018 707.8253 716.9212 744.3660 763.5383 774.1326 798.4490 814.5645 816.7483 837.9859 843.5612 857.5931 872.7266 885.0928 894.6197 924.6302 946.0134 952.9682 959.3504 976.4488 988.3903 1000.3848 1025.3668 1034.0309 1034.7017 1041.2394 1043.7257 1065.5547 1067.5826 1088.6100 1091.0944 1093.9204 1106.2565 1112.5212 1122.5210 1139.9195 1166.3302 1172.4636 1176.6838 1181.7674 1193.4418 1197.5202 1210.0954 1223.5774 1229.0374 1238.1124 1248.0151 1254.4019 1266.8593 1282.1432 1285.9350 1303.5773 1319.4720 1335.2611 1340.2080 1355.8928 1359.1698 1374.8849 1381.5870 1391.4052 1401.5890 1408.4042 1419.4869 1441.0757 1442.0061 1443.8703 1458.5491 1461.1808 1461.7567 1466.4574 1468.1327 1474.6851 1476.9535 1479.4461 1484.8812 1487.5632 1489.7748 1579.8685 1593.7295 1598.8074 1611.4518 2846.1618 2856.4387 2881.1704 2918.5554 2927.4041 2928.5197 2940.7914 2956.6737 2983.4547 2990.2538 2996.6415 3012.6271 3015.5761 3018.4884 3026.9348 3046.4857 3063.5473 3077.9009 3084.8514 3110.1258 3117.5841 3120.8425 3136.6531 3149.0583 3158.9080 3169.3955
redmass: 2.5220 5.6550 4.7317 6.1249 4.4874 4.3542 3.7742 2.1420 3.6503 3.2427 3.4032 4.4207 3.5561 5.6450 4.4594 1.1510 1.5447 2.0750 4.4041 2.6782 2.9582 5.1242 3.5909 3.8726 3.7379 3.3457 2.3934 4.7438 3.2795 3.1309 2.7416 3.0928 2.6975 3.8620 3.4908 4.2222 3.4373 4.0205 3.7482 5.7944 5.8724 3.5131 4.0963 3.8501 1.5886 2.4784 3.2001 1.2540 1.4083 2.5512 3.8391 3.0615 1.5644 1.6528 2.2129 3.1468 1.8067 1.4765 2.7409 2.2860 1.3365 3.6186 2.5600 1.5857 2.6589 2.6981 2.3492 2.6114 1.7095 1.5565 2.3200 2.3022 1.9884 2.1855 1.7970 1.4962 1.3871 1.1356 1.8562 1.7352 1.3837 1.1685 1.9669 1.5328 1.5721 1.7438 1.1565 1.4768 2.5132 1.3647 1.2447 1.2140 1.2968 1.8171 1.3247 1.6559 1.3658 1.5463 3.6429 3.4355 2.6220 1.5576 1.1682 2.1973 1.1712 1.1397 1.0794 1.0815 1.0588 1.0667 1.1011 1.0586 1.0776 2.4358 1.0564 2.5491 1.0787 7.3114 6.6021 6.9312 6.4468 1.0572 1.0588 1.0683 1.0579 1.0594 1.0833 1.0615 1.0617 1.1021 1.1008 1.0684 1.0902 1.0990 1.0725 1.0720 1.0917 1.1011 1.1007 1.1004 1.0873 1.0884 1.0894 1.0926 1.0921 1.1004 1.0956
irintensity: 0.3391 0.1897 0.1443 0.1701 1.6345 0.7678 1.5073 2.5122 1.1367 2.6628 1.2287 3.0571 1.2990 3.5885 0.5910 0.9536 0.7147 0.2087 7.4691 1.8343 1.0666 1.6953 2.7861 0.8652 3.3269 0.9182 10.8958 2.3846 4.4689 6.9771 6.6759 3.9573 0.3327 8.2020 3.0022 1.6134 4.6178 7.6762 27.7106 7.7138 10.3509 4.5651 33.2204 1.5874 39.4309 17.1354 19.2164 2.6352 31.3796 6.1600 27.6708 7.7045 18.9072 12.7368 6.9971 8.0915 35.0803 7.5849 42.7678 3.0755 0.1017 91.5497 10.1288 14.2919 3.6716 99.8563 14.8790 63.9008 43.8906 1.3571 27.6179 14.9217 5.9223 9.9856 14.2372 1.6455 4.3869 1.4319 8.1509 0.3235 7.1960 21.3430 16.8545 0.7960 1.7447 7.8680 0.9374 9.6169 12.4842 9.6419 4.9489 19.0987 9.6968 8.7708 7.4239 4.6835 6.3731 0.3677 1.2169 0.6602 7.8104 3.4423 2.3832 3.9380 3.3435 15.0539 13.7616 9.1217 13.6009 2.1376 26.0417 16.7802 6.0573 69.0490 9.7776 14.8841 8.7931 5.5854 0.4502 13.5070 3.8642 68.9748 145.1450 122.0760 8.7120 62.9616 41.7247 153.2112 21.9855 47.1437 32.8267 23.0691 39.2694 41.4612 43.2270 53.7962 33.6681 6.4080 36.4972 48.5604 9.9132 3.2684 13.0293 25.3876 2.2982 36.9993 5.1965
temp: 298.150 k
press: 1.00000 atm
elementType: 17 8 8 7 6 6 6 6 6 6 6 6 6 6 6 6 6 6 6 6 6 6 6 6 6 1 1 1 1 1 1 1 1 1 1 1 1 1 1 1 1 1 1 1 1 1 1 1 1 1 1
symmnumber: 1
zpe: 1107778.2 jmol-1
zpe.correction: 0.421930 hartree
zpe.thermalcorrener: 0.446002 hartree
zpe.thermalcorrenthalpy: 0.446947 hartree
zpe.thermalcorrgfe: 0.364841 hartree
zpe.sumelectzpe: -1479.176886 hartree
zpe.sumelectthermal: -1479.152814 hartree
zpe.sumelectthermalent: -1479.151870 hartree
zpe.sumelectthermalfe: -1479.233976 hartree
dipole: 3.1192 1.9107 0.2096
dipole: 3.6639
quadrupole: -158.7071 -157.1313 -138.1307
quadrupole: -5.6231 -1.6646 -4.4222
quadrupole: -7.3840 -5.8082 13.1923 -5.6231 -1.6646 -4.4222
hfenergy: -1479.5988167 hartree
pointgroup: C01 [X(C21H26Cl1N1O2)]
dipole: -1.1372145 0.8677597 -0.1779041 debye
polarizability: 251.1137784|-34.0638837|258.6304312|30.1814932|-0.7243754|233.1925726 unknown
InChI: InChI=1S/C21H26ClNO2/c1-23(2)11-12-24-13-14-25-21-19-6-4-3-5-16(19)7-8-17-9-10-18(22)15-20(17)21/h3-6,9-10,15,21H,7-8,11-14H2,1-2H3
charge 0 multiplicity 1
51 atoms
Cl 5.274987 -3.371148 1.259646
O  0.169181 -0.361586 1.281495
O  -2.773175 -0.043321 1.049222
N  -5.947498 -1.14787 -0.603428
C  1.485119 0.291938 1.035069
C  2.293427 -0.711355 0.214544
C  1.354279 1.685014 0.424119
C  1.158471 -0.219029 -2.126024
C  0.058995 0.69574 -1.531048
C  2.123895 -0.946619 -1.182858
C  0.644307 1.886292 -0.794053
C  3.256433 -1.464587 0.938573
C  1.930958 2.79081 1.091479
C  2.944025 -1.934655 -1.794253
C  0.529777 3.200067 -1.3068
C  -0.694174 0.381928 2.210813
C  4.044582 -2.426837 0.292024
C  1.820503 4.097999 0.565289
C  3.90534 -2.680173 -1.083925
C  1.111906 4.302958 -0.639215
C  -2.027282 -0.348949 2.273045
C  -4.019648 -0.812946 0.949501
C  -4.679358 -0.414047 -0.378253
C  -7.072279 -0.624749 0.198932
C  -6.299997 -1.248968 -2.03396
H  1.99158 0.408352 2.019634
H  0.659835 -0.989639 -2.747152
H  1.772181 0.386124 -2.82627
H  -0.572615 1.053034 -2.365846
H  -0.581292 0.108988 -0.848611
H  3.377948 -1.295094 2.013197
H  2.473277 2.627988 2.031875
H  2.823493 -2.1253 -2.868018
H  -0.022726 3.358782 -2.241102
H  -0.225541 0.411051 3.220028
H  -0.855174 1.421472 1.861002
H  2.275726 4.944293 1.091441
H  4.522154 -3.432577 -1.583438
H  1.010982 5.312003 -1.054752
H  -2.602749 -0.008909 3.164087
H  -1.850562 -1.442739 2.360986
H  -4.675926 -0.582831 1.818531
H  -3.810376 -1.903477 0.950305
H  -3.974894 -0.668704 -1.190739
H  -4.815277 0.69596 -0.398352
H  -7.354422 0.424788 -0.074366
H  -6.820215 -0.639699 1.27313
H  -7.959788 -1.266429 0.053765
H  -5.474059 -1.727069 -2.589615
H  -6.514642 -0.259462 -2.513231
H  -7.198791 -1.881711 -2.149324
