program: Gaussian 09
title: 000027195
version: EM64L-G09RevD.01
frameworkgroup: C1[X(C13H10INO)]
method: RPBEPBE
basis: SDD
operation: Freq
keyword: #p
keyword: freq=noraman
keyword: PBEPBE/SDD
title: #p freq=noraman PBEPBE/SDD
converged: YES YES NO NO
title: Mulliken charges:
elementType: I O N C C C C C C C C C C C C C H H H H H H H H H H
charge: 0.106234 -0.252724 -0.444637 0.314026 0.494571 0.112769 -0.491569 -0.331303 -0.343301 -0.436612 -0.156342 -0.226189 -0.215621 -0.201381 -0.216450 -0.252340 0.315070 0.277661 0.307721 0.221982 0.253078 0.240245 0.227522 0.227061 0.241020 0.229509
chargesum: 0.00000
title: Mulliken charges with hydrogens summed into heavy atoms:
elementType: I O N C C C C C C C C C C C C C
charge: 0.106234 -0.252724 -0.129567 0.314026 0.494571 0.112769 -0.491569 -0.053642 -0.035580 -0.214630 0.096737 0.014056 0.011901 0.025680 0.024570 -0.022831
polarizability: 2.56825691e+02 -3.10818596e+01 1.85714280e+02 -1.29133051e+01 -1.42422281e+01 8.91373140e+01
1716.lowfreq: -10.7116 -2.1208 -0.0009 -0.0005 -0.0005 2.1122 21.9310 33.2384 56.8157
frequency: 21.1548 33.2228 56.7967 87.1562 113.1600 136.9616 177.2900 215.6484 245.5740 275.8057 316.9089 340.8377 405.6297 410.4901 454.8447 500.2389 513.7503 576.8603 614.6940 626.2399 644.5999 680.6703 686.3093 696.8386 735.7267 770.3625 775.1148 817.2360 844.4422 866.2416 879.7012 920.0455 962.7170 974.6367 984.4762 987.7579 995.6915 1001.3280 1024.6732 1037.2644 1086.8148 1108.9912 1114.6173 1172.7565 1176.4036 1188.8439 1232.7274 1261.8629 1267.7764 1323.2884 1355.8391 1385.7946 1409.7181 1430.1683 1445.7334 1484.8680 1518.4633 1559.1524 1588.8259 1593.4742 1605.4569 1614.6938 3112.9154 3133.0428 3139.9229 3145.6668 3152.6262 3165.7575 3165.8822 3176.8443 3197.9846 3503.1679
redmass: 5.0098 7.1493 5.5611 5.7662 4.8520 6.8783 6.1189 6.6638 5.2351 5.2447 5.9747 7.8268 3.6672 3.4076 4.0832 5.1096 2.8463 5.4683 6.4198 4.3621 1.4126 4.5581 6.3320 2.0101 2.4813 1.6382 1.7257 5.0827 1.2678 5.5651 1.4850 1.4321 1.3895 1.3550 6.2213 7.3610 1.3570 1.3081 2.4135 2.6466 1.6179 2.2258 1.8873 1.0520 1.0604 1.1144 2.5760 1.9891 1.5810 1.4864 9.0054 6.6106 2.1121 2.3758 2.3483 2.3862 2.1832 5.7536 7.0271 7.7619 3.6445 6.1524 1.0885 1.0869 1.0860 1.0935 1.0903 1.0998 1.0953 1.1006 1.0951 1.0767
irintensity: 2.7132 0.4317 1.7967 4.5061 0.6243 0.6018 1.9236 1.5405 4.3189 3.4101 4.2082 6.3635 0.9394 0.3182 9.8974 11.4005 24.2947 9.1435 1.1018 4.9764 42.4929 23.1811 5.6769 55.6663 28.6632 128.4544 21.1361 0.4556 0.2438 16.9103 1.4141 12.0083 1.9168 0.5819 4.8769 51.5508 0.7626 2.9248 2.2837 12.2197 15.6972 2.2571 8.7720 0.5343 0.8213 0.8865 25.5991 48.5506 17.6341 58.7707 6.6299 59.0881 20.8437 100.7009 8.8105 69.1267 344.3863 10.7043 49.0041 151.5932 22.4428 31.6660 14.0030 0.6126 1.7489 29.4689 4.4915 28.1325 5.8384 20.9106 7.2644 23.0328
temp: 298.150 k
press: 1.00000 atm
elementType: 53 8 7 6 6 6 6 6 6 6 6 6 6 6 6 6 1 1 1 1 1 1 1 1 1 1
symmnumber: 1
zpe: 509783.7 jmol-1
zpe.correction: 0.194166 hartree
zpe.thermalcorrener: 0.207958 hartree
zpe.thermalcorrenthalpy: 0.208903 hartree
zpe.thermalcorrgfe: 0.150279 hartree
zpe.sumelectzpe: -641.768402 hartree
zpe.sumelectthermal: -641.754610 hartree
zpe.sumelectthermalent: -641.753666 hartree
zpe.sumelectthermalfe: -641.812289 hartree
dipole: -1.6885 -1.1064 2.6426
dipole: 3.3254
quadrupole: -87.7730 -104.4715 -111.5516
quadrupole: -8.2682 -2.2630 0.7608
quadrupole: 13.4923 -3.2061 -10.2862 -8.2682 -2.2630 0.7608
hfenergy: -641.9625684 hartree
pointgroup: C01 [X(C13H10I1N1O1)]
dipole: -0.5702167 -0.2611994 -1.1481808 debye
dipolederiv: -0.0868415 -0.1832536 0.0999596 -0.1178132 -0.3247617 0.149293 0.0792927 0.1617298 -0.0815241 -0.7007044 0.0765582 -0.1857996 -0.0599246 -0.3512528 0.1255561 0.4182637 0.0968918 -0.9186446 -1.6927641 0.029877 0.2354685 -0.0252201 -0.3102034 0.0303158 0.5041829 0.0664146 -0.4702374 -0.3098065 -0.1705385 0.0070669 -0.0865166 -0.23595 0.1722445 -0.181848 0.1411443 -0.1534456 1.2177286 0.0136004 -0.0365241 0.0011866 0.0824162 0.0260369 0.132517 0.0123352 0.0321337 1.7221843 -0.1253587 0.0497939 0.1984772 0.2221336 -0.1925351 -0.8636648 -0.1471952 1.2139432 0.162591 0.5204642 -0.2172094 0.2627447 0.6733767 -0.436455 0.0567989 -0.4574145 0.1173469 -0.0496622 0.0501258 0.0141196 0.0123201 -0.0363452 -0.0507008 -0.0383165 -0.0638008 -0.0546362 -0.2905656 0.0144257 -0.015495 0.0094294 -0.1536645 -0.0194394 -0.1444324 -0.0163178 -0.0697739 -0.244704 0.005038 0.0299966 -0.0252537 -0.186819 -0.048439 0.1519308 -0.0197929 0.0095721 -0.2475844 -0.1750262 0.0857285 -0.2528587 -0.2570157 0.0302819 0.1323329 0.0762985 -0.0885375 -0.0160686 0.1216156 -0.066078 0.0827899 -0.0222152 -0.0861272 -0.0099285 -0.0695778 -0.0897278 0.0744222 0.0028156 0.0426343 -0.0097027 -0.1331057 -0.0477147 0.1223885 -0.0451828 0.1393149 0.0529779 0.0155009 -0.0149366 0.0393938 -0.1294895 -0.0448587 -0.1262329 -0.0480474 0.1165175 0.0659603 -0.0233775 0.084095 0.1246149 0.020132 -0.0817018 -0.0362267 -0.1150491 -0.0511211 -0.0333273 0.0166808 0.0152091 0.0030611 -0.1774451 -0.0074056 0.0259291 -0.0083324 -0.1351019 0.2152299 -0.0676324 0.0311155 -0.0797596 0.3205926 0.0397864 -0.0422916 0.0134809 0.114773 0.1129667 0.0111546 -0.034838 0.041558 0.0636075 0.0640399 -0.01982 0.089704 0.0830658 0.1716623 -0.0195175 0.0595759 -0.0010241 0.1699127 0.0287649 0.0346091 0.0166308 0.0669735 0.0155532 0.008393 -0.1160292 -0.0008303 0.1488747 0.0369351 -0.1054329 0.0245429 -0.0404406 0.0627297 0.0268615 -0.0476501 0.0478162 0.0489428 0.0950391 -0.0696316 0.0800394 0.076979 0.0135426 -0.085783 0.0291604 -0.1053993 0.0134252 0.0908345 0.0354787 0.08861 0.0991976 0.0187509 0.0062795 -0.0774533 0.0112629 0.1467208 0.0329346 -0.1096804 0.0312857 -0.0664692 0.0129523 -0.0160043 0.0834505 -0.027566 0.1477644 0.0416847 0.111767 0.0391018 -0.0606417 -0.1031656 -0.0387898 -0.0462537 -0.0266744 0.096461 0.0384617 -0.0505182 0.041311 0.1172969 -0.1440575 -0.0141095 -0.0091073 -0.0161113 0.1639075 0.0131683 -0.0074667 0.0111901 0.0931875 unknown
polarizability: 263.8376815|24.3030796|127.0575308|-1.3936327|-46.407699|140.7820727 unknown
InChI: InChI=1S/C13H10INO/c14-12-9-5-4-8-11(12)13(16)15-10-6-2-1-3-7-10/h1-9,15H
charge 0 multiplicity 1
26 atoms
I  -1.393253 2.30546 -1.577155
O  -0.06603 -0.580071 1.875535
N  0.616999 -0.15326 -0.329216
C  -1.785187 -0.319431 0.19324
C  2.034451 -0.09426 -0.196889
C  -0.339914 -0.33498 0.660134
C  -2.408352 0.593466 -0.699274
C  -2.604413 -1.325295 0.782644
C  2.709233 -0.259614 1.042739
C  2.783439 0.143098 -1.382271
C  -3.783364 0.486584 -1.015339
C  -3.9704 -1.446656 0.470002
C  4.118454 -0.182135 1.074748
C  4.189344 0.215914 -1.331711
C  -4.561629 -0.541141 -0.439809
C  4.867489 0.053574 -0.100681
H  0.265183 -0.004032 -1.278883
H  -2.127967 -1.995814 1.505024
H  2.129723 -0.443664 1.948613
H  2.263064 0.274001 -2.340167
H  -4.246962 1.207399 -1.694419
H  -4.569931 -2.235438 0.935507
H  4.633712 -0.309375 2.033438
H  4.753759 0.400313 -2.252332
H  -5.624557 -0.615902 -0.692599
H  5.960407 0.109857 -0.060279
