program: Gaussian 09
title: 000295709
version: EM64L-G09RevD.01
frameworkgroup: C1[X(C10H14N2O3S)]
method: RPBEPBE
basis: SDD
operation: Freq
keyword: #p
keyword: freq=noraman
keyword: PBEPBE/SDD
title: #p freq=noraman PBEPBE/SDD
converged: YES YES NO NO
title: Mulliken charges:
elementType: S O O O N N C C C C C C C C C C H H H H H H H H H H H H H H
charge: 0.299201 -0.209117 -0.299696 -0.224687 -0.010445 0.040507 0.050697 0.183736 -0.227962 0.194231 -0.347028 -0.256311 -0.404457 -0.671760 -0.665176 -0.823908 0.224765 0.225039 0.294865 0.222356 0.234586 0.206452 0.237656 0.236738 0.217015 0.249919 0.226582 0.274728 0.274577 0.246899
chargesum: 0.00000
title: Mulliken charges with hydrogens summed into heavy atoms:
elementType: S O O O N N C C C C C C C C C C
charge: 0.299201 -0.209117 -0.299696 -0.224687 -0.010445 0.040507 0.050697 0.183736 0.221842 0.194231 -0.052163 0.200630 -0.404457 0.009085 0.028340 -0.027705
polarizability: 2.42538502e+02 6.63147671e+00 1.69618002e+02 -5.26641275e+00 1.62622039e+00 8.37155650e+01
1716.lowfreq: -2.3688 0.0021 0.0021 0.0025 2.4836 4.8748 19.1421 38.0719 54.4284
frequency: 18.7027 38.0450 54.4088 62.5897 75.9170 94.2146 99.5033 112.6741 116.5420 121.7914 181.0746 196.5941 213.8338 238.1053 265.5060 279.8983 291.1713 325.3368 349.1630 360.2635 422.3821 444.3928 489.1364 536.7810 624.7150 649.4386 661.6327 692.4736 712.3438 741.4867 788.4456 801.3439 813.3504 824.0788 835.0705 926.8929 958.8772 978.6906 979.2501 995.1270 1014.5269 1030.8094 1094.8803 1110.4564 1131.1027 1140.3268 1154.7626 1216.5338 1244.4982 1263.1473 1279.2459 1280.6130 1305.0901 1335.2158 1353.1451 1358.1222 1387.4416 1389.2243 1402.3440 1436.9081 1450.6834 1457.1106 1460.2992 1462.3810 1466.0224 1480.9092 1484.3871 1493.1272 1531.2394 1627.4272 2992.3157 2998.7367 3010.2217 3023.4615 3028.9758 3071.8412 3087.5642 3091.9654 3095.8848 3113.6690 3117.7358 3147.7587 3153.0472 3184.1792
redmass: 4.5009 3.8534 3.0351 3.3790 3.1609 3.4933 2.8730 2.0406 3.0332 1.4556 2.7724 6.9361 1.3825 1.3484 4.8043 3.8183 5.1066 3.3673 6.5606 5.7276 3.5544 3.8050 7.8108 6.9813 6.9848 11.6083 7.1611 6.3940 12.1463 3.5972 8.0431 1.1019 1.4230 3.5478 4.0609 6.1970 1.4459 1.2431 2.8077 1.3704 2.2642 5.1160 2.1765 2.3733 1.4373 5.5833 1.7091 6.5812 1.1464 2.1830 6.1299 1.2331 3.4394 1.3939 1.3420 1.3734 2.2406 1.2368 1.3220 1.0526 1.0564 1.0959 1.0394 1.0468 1.2335 1.3612 1.0519 2.2429 6.4152 10.5436 1.0360 1.0363 1.0576 1.0282 1.0592 1.1070 1.0975 1.1034 1.0985 1.1024 1.1057 1.1040 1.1056 1.0932
irintensity: 1.3431 2.0296 0.1082 0.7868 0.1300 0.4099 0.7011 2.8312 1.6738 1.7429 2.2759 0.0688 1.9836 0.1281 3.3252 4.0949 9.9394 12.3612 3.0355 12.2585 6.8850 1.7159 10.4295 5.1039 0.6416 0.3503 0.8626 7.2645 3.2776 6.6445 17.3723 3.4606 1.6421 8.5829 5.1678 82.3961 7.4137 12.7703 55.9327 0.3923 75.9397 324.6608 46.0229 52.5102 4.7418 500.8879 10.8886 38.0463 0.0303 182.3093 12.4361 1.6611 67.9256 123.9327 35.7455 2.3359 209.2215 21.4179 16.2966 15.6038 26.3770 13.7461 12.3512 11.6076 79.6633 49.8156 11.8264 159.2169 442.7281 288.5808 23.0723 20.2030 18.5141 21.4917 37.8011 10.1821 40.6587 1.3474 24.4008 36.3684 31.4035 10.7697 12.6063 0.9431
temp: 298.150 k
press: 1.00000 atm
elementType: 16 8 8 8 7 7 6 6 6 6 6 6 6 6 6 6 1 1 1 1 1 1 1 1 1 1 1 1 1 1
symmnumber: 1
zpe: 606091.5 jmol-1
zpe.correction: 0.230848 hartree
zpe.thermalcorrener: 0.248762 hartree
zpe.thermalcorrenthalpy: 0.249706 hartree
zpe.thermalcorrgfe: 0.182525 hartree
zpe.sumelectzpe: -1121.473409 hartree
zpe.sumelectthermal: -1121.455494 hartree
zpe.sumelectthermalent: -1121.454550 hartree
zpe.sumelectthermalfe: -1121.521731 hartree
dipole: -0.6436 2.3335 0.2655
dipole: 2.4351
quadrupole: -81.6364 -105.1137 -101.1823
quadrupole: -17.0966 -0.9595 0.1885
quadrupole: 14.3410 -9.1362 -5.2048 -17.0966 -0.9595 0.1885
hfenergy: -1121.7042567 hartree
pointgroup: C01[X(C10H14N2O3S1)]
dipole: 0.3545806 -0.8491998 0.2664662 debye
polarizability: 240.269096|14.9685922|168.3773597|1.0331579|-17.513796|87.2256135 unknown
InChI: InChI=1S/C10H14N2O3S/c1-4-14-8-7(9(13)15-5-2)6-11-10(12-8)16-3/h6H,4-5H2,1-3H3
charge 0 multiplicity 1
30 atoms
S  3.538458 2.305383 -0.762346
O  0.49029 -1.720472 -0.099884
O  -2.904246 0.816111 -0.892137
O  -2.291626 -1.34155 -0.234889
N  1.840402 0.174212 -0.413405
N  0.86695 2.342148 -0.939777
C  -0.587056 0.389021 -0.598992
C  0.599396 -0.386114 -0.367321
C  1.750396 -2.498158 0.130727
C  -1.961062 -0.17201 -0.54132
C  -0.363294 1.763487 -0.88584
C  -4.3378 0.403438 -0.835031
C  1.918797 1.502582 -0.693024
C  1.310116 -3.933442 0.394584
C  -4.899275 0.581654 0.578966
C  4.667999 0.8535 -0.374056
H  2.388361 -2.403039 -0.766261
H  2.2853 -2.048802 0.986602
H  -1.219746 2.413822 -1.07753
H  -4.827955 1.070557 -1.562329
H  -4.415666 -0.646738 -1.166991
H  2.19739 -4.56798 0.573643
H  0.654839 -3.986745 1.279993
H  0.756471 -4.339107 -0.468681
H  -5.981278 0.352451 0.581668
H  -4.401033 -0.101965 1.286495
H  -4.765527 1.620007 0.928371
H  4.541918 0.068949 -1.133081
H  4.432898 0.453803 0.622222
H  5.689886 1.262694 -0.400175
