program: Gaussian 09
title: 000295717
version: EM64L-G09RevD.01
frameworkgroup: C1[X(C10H18N3O4PS)]
method: RPBEPBE
basis: SDD
operation: Freq
keyword: #p
keyword: freq=noraman
keyword: PBEPBE/SDD
title: #p freq=noraman PBEPBE/SDD
converged: YES YES NO NO
title: Mulliken charges:
elementType: S P O O O O N N N C C C C C C C C C C H H H H H H H H H H H H H H H H H H
charge: 0.280284 1.302671 -0.493448 -0.590344 -0.428077 -0.593673 -0.005860 0.039165 -0.643332 -0.546341 0.275546 0.105354 -0.216785 -0.239155 -0.415499 -0.665977 -0.645261 -0.403267 -0.830726 0.282712 0.243596 0.209491 0.231874 0.220937 0.281982 0.362848 0.206123 0.228962 0.241405 0.274755 0.212674 0.214771 0.319055 0.390717 0.243006 0.273667 0.276150
chargesum: 0.00000
title: Mulliken charges with hydrogens summed into heavy atoms:
elementType: S P O O O O N N N C C C C C C C C C C
charge: 0.280284 1.302671 -0.493448 -0.590344 -0.065229 -0.593673 -0.005860 0.039165 0.066440 -0.263629 0.275546 0.105354 0.236302 0.213656 -0.133517 0.010513 0.056939 -0.403267 -0.037902
polarizability: 2.93634534e+02 -9.12804529e+00 1.69527219e+02 -8.96951884e+00 -1.79195567e+01 1.42941592e+02
1716.lowfreq: -7.2699 0.0016 0.0018 0.0021 4.1887 6.3222 21.9840 29.8818 40.6023
frequency: 21.8205 29.8338 40.5998 48.9590 57.2432 78.6129 89.1266 93.9154 108.1119 113.0491 122.7666 130.4584 145.8976 181.8752 194.0295 196.4733 208.3396 229.3584 237.4301 249.0055 253.6472 267.1370 291.1501 320.0128 335.6499 367.0003 400.3079 411.8551 425.3454 441.5193 472.1697 539.1581 544.1814 586.8357 599.2756 633.9870 656.4468 672.6097 685.4653 700.2444 732.5376 777.0264 791.2877 803.4366 822.0303 854.9475 874.3913 901.0284 939.9706 962.9984 978.2471 992.1430 1013.4446 1017.5091 1047.8978 1058.8670 1096.8532 1105.1829 1132.7309 1147.7316 1164.9892 1174.5444 1205.5764 1258.8965 1265.0013 1270.6807 1289.2511 1300.6774 1326.0232 1340.0236 1345.5294 1357.5054 1363.0702 1393.3992 1394.5497 1432.7147 1435.1558 1452.6796 1456.3786 1459.4382 1473.3698 1479.6806 1489.6104 1491.1054 1530.1157 1549.2589 1656.1262 2965.3358 2978.6325 2987.7164 2995.5225 3002.3974 3022.3051 3048.2531 3069.5952 3083.5084 3091.7500 3110.0402 3112.2499 3140.9441 3146.0495 3152.5195 3338.0678 3541.7146 3607.6548
redmass: 4.5512 4.2066 3.3961 3.4610 3.6138 2.4679 2.2597 2.1698 1.9985 3.5963 3.2113 3.5061 5.9364 4.0848 4.6891 4.1513 6.4261 1.3727 2.6850 1.6856 2.7401 1.5732 3.7832 4.4783 5.8765 5.3163 6.0099 5.0347 4.3224 4.4261 4.4625 5.1593 4.7779 5.5197 1.6574 3.2557 6.8597 8.1100 8.5413 5.3035 1.2514 5.7238 6.2441 1.1169 1.0855 3.4093 3.9973 4.8800 1.4191 6.4000 1.1804 1.3066 2.9722 2.8673 6.0564 3.3641 2.1259 2.2387 1.4049 1.5477 3.5209 1.5877 1.6526 1.1532 1.1276 1.6143 2.7036 1.7964 1.8870 1.2999 1.2223 1.2458 2.1696 1.2248 1.2370 3.5187 1.0562 1.1012 1.0395 1.0395 1.0748 1.0480 1.0564 1.0874 5.1587 5.6911 1.2129 1.0834 1.0571 1.0363 1.0371 1.0609 1.0282 1.1069 1.1045 1.0985 1.0979 1.1027 1.1019 1.0923 1.1039 1.1055 1.0612 1.0660 1.0904
irintensity: 1.4977 0.0832 1.1846 0.4624 0.3389 0.9466 2.0253 1.2112 0.9042 0.7109 1.5862 5.1276 3.4646 13.5845 4.7710 5.8011 3.3604 2.1979 0.5593 5.4702 35.9401 93.6882 9.7935 12.0498 5.2506 4.9169 35.3802 5.7763 19.3365 3.4510 54.3385 3.6169 8.7174 106.1971 76.7644 23.3794 4.0949 35.1768 8.2680 93.1469 173.1053 20.4346 25.3999 1.9331 3.7876 112.8098 190.4203 10.6763 3.8040 64.0318 8.0288 8.1873 169.5168 153.6123 68.0212 89.1862 18.9992 13.0458 3.5625 11.8372 117.2629 26.6251 43.3781 0.7167 3.7049 125.6655 0.6183 23.4044 19.5906 51.2008 12.0572 9.3402 155.9581 27.6950 26.0691 89.5519 14.7038 13.6632 11.8563 16.3474 1.9427 8.5699 11.0092 12.0769 148.1618 436.4122 153.0271 8.3191 33.5435 19.2307 28.8723 41.4107 24.4946 11.7657 10.7686 37.9556 27.4335 19.0640 27.9007 5.3672 12.0908 12.7717 345.4171 9.4474 76.6997
temp: 298.150 k
press: 1.00000 atm
elementType: 16 15 8 8 8 8 7 7 7 6 6 6 6 6 6 6 6 6 6 1 1 1 1 1 1 1 1 1 1 1 1 1 1 1 1 1 1
symmnumber: 1
zpe: 747551.0 jmol-1
zpe.correction: 0.284727 hartree
zpe.thermalcorrener: 0.307824 hartree
zpe.thermalcorrenthalpy: 0.308768 hartree
zpe.thermalcorrgfe: 0.230501 hartree
zpe.sumelectzpe: -1594.796509 hartree
zpe.sumelectthermal: -1594.773411 hartree
zpe.sumelectthermalent: -1594.772467 hartree
zpe.sumelectthermalfe: -1594.850734 hartree
dipole: 2.3870 2.6102 -7.0019
dipole: 7.8446
quadrupole: -126.2083 -114.3910 -136.8782
quadrupole: -5.7704 -2.9241 1.5172
quadrupole: -0.3824 11.4349 -11.0524 -5.7704 -2.9241 1.5172
hfenergy: -1595.0812357 hartree
pointgroup: C01 [X(C10H18N3O4P1S1)]
dipole: -1.0297386 -1.1999525 -2.6504712 debye
polarizability: 293.822826|-9.6226205|172.0803948|5.4639129|16.0980688|140.2001239 unknown
InChI: InChI=1S/C10H18N3O4PS/c1-4-16-18(15,17-5-2)9(14)7-6-12-10(19-3)13-8(7)11/h6,9,14H,4-5,11H2,1-3H3
charge 0 multiplicity 1
37 atoms
S  5.178645 0.36388 0.089028
P  -1.98087 0.032662 0.558618
O  -3.6098 0.588925 0.340277
O  -1.894814 -1.431942 -0.432984
O  -1.164407 2.415208 -0.38626
O  -1.647464 -0.173796 2.095552
N  2.731643 -0.470371 -0.836837
N  2.794253 1.411794 0.714727
N  0.702874 -1.306625 -1.673017
C  -0.773579 1.019967 -0.582936
C  0.671225 0.732276 -0.298949
C  1.367211 -0.3530 -0.938578
C  -4.075471 1.039281 -1.007505
C  -2.53643 -2.677219 0.093221
C  1.44614 1.544205 0.562726
C  -5.545989 1.409364 -0.839189
C  -1.613378 -3.422445 1.061904
C  3.370747 0.426963 -0.044844
C  5.560439 -1.091963 -1.036922
H  -1.035685 0.671891 -1.603455
H  -3.468326 1.910916 -1.316257
H  -3.942652 0.213126 -1.734327
H  -3.49379 -2.403096 0.576076
H  -2.754583 -3.266823 -0.813962
H  0.971721 2.332968 1.157208
H  -0.436936 3.000066 -0.722707
H  -5.957108 1.769387 -1.800874
H  -6.135253 0.537146 -0.509075
H  -5.656423 2.209167 -0.088201
H  -1.408508 -2.805347 1.952528
H  -2.096636 -4.363152 1.386982
H  -0.65393 -3.677387 0.578306
H  1.277877 -2.028434 -2.107589
H  -0.293224 -1.492843 -1.47913
H  6.655458 -1.205915 -1.007551
H  5.216668 -0.876668 -2.058173
H  5.062053 -1.995068 -0.658033
