program: Gaussian 09
title: 000295676
version: EM64L-G09RevD.01
frameworkgroup: C1[X(C12H10N2O3)]
method: RPBEPBE
basis: SDD
operation: Freq
keyword: #p
keyword: freq=noraman
keyword: PBEPBE/SDD
title: #p freq=noraman PBEPBE/SDD
converged: NO YES NO NO
title: Mulliken charges:
elementType: O O O N N C C C C C C C C C C C C H H H H H H H H H H
charge: -0.238577 -0.214445 -0.212758 -0.039977 0.032341 0.476780 -0.439598 -0.384241 -0.384229 0.157032 -0.224491 -0.224596 -0.282408 0.337484 -0.229000 -0.229127 -0.399977 0.238091 0.238357 0.234816 0.234712 0.269535 0.230858 0.230901 0.295691 0.233147 0.293680
chargesum: 0.00000
title: Mulliken charges with hydrogens summed into heavy atoms:
elementType: O O O N N C C C C C C C C C C C C
charge: -0.238577 -0.214445 -0.212758 -0.039977 0.032341 0.476780 0.036850 -0.149425 -0.149518 0.157032 0.006367 0.006305 -0.012873 0.337484 0.004147 0.066564 -0.106297
polarizability: 2.76713134e+02 1.18502341e+01 1.18838120e+02 -9.71723591e-02 -3.49229639e-02 1.04714375e+02
1716.lowfreq: -12.3541 -1.6927 -0.0005 -0.0004 0.0006 5.0863 8.4814 15.5646 51.3031
frequency: 5.3479 15.5440 51.2789 59.9691 78.7181 127.2957 145.2219 209.8036 243.1365 281.4946 324.7728 362.6563 401.3542 420.1756 426.2845 495.8768 501.8243 526.9377 562.1516 616.9144 619.5724 656.6568 676.8443 701.8949 747.6757 758.4540 772.9274 810.7263 844.1538 846.2251 853.0702 894.5508 931.9356 944.4164 955.3226 977.4054 977.9476 991.2826 992.6485 999.7153 1026.1474 1089.0847 1099.5643 1127.0090 1174.3316 1187.8245 1189.4778 1218.9125 1229.1074 1254.5472 1278.8061 1325.1029 1330.6407 1347.3287 1362.2910 1386.8829 1391.9439 1441.2058 1448.3216 1465.3827 1487.0751 1551.9746 1586.1757 1596.7171 1618.0266 3022.9383 3089.6002 3124.2488 3125.5532 3138.3715 3151.5180 3167.5453 3171.6895 3178.5248 3196.5165
redmass: 5.2255 4.3394 6.1296 8.1830 6.6275 7.2783 6.0039 7.2013 5.8036 6.8170 2.2049 7.3514 2.7878 3.7356 6.5632 5.4685 3.1514 4.2972 6.0523 6.3360 8.1474 8.0083 6.7987 1.8223 2.4148 5.5851 5.0621 6.0435 1.4841 3.5869 1.2484 7.6761 1.5516 1.6213 1.4497 1.3944 3.6285 6.2028 1.3221 1.3258 2.1774 1.5170 2.1159 1.6365 1.0546 1.1158 1.0826 8.5178 2.3917 2.1825 1.9305 1.2763 2.2147 3.0770 5.8020 8.8108 4.2370 2.1933 2.6032 1.1080 2.4410 7.9889 6.5211 6.1365 6.2102 1.0579 1.1079 1.0858 1.0886 1.0917 1.0962 1.1016 1.0928 1.0895 1.0988
irintensity: 0.2771 0.4307 0.1767 0.1830 0.0002 3.1015 10.1047 3.5713 1.2457 0.0150 0.7441 0.3635 0.0017 3.6592 0.2543 3.8664 3.3973 17.3572 10.3350 0.1188 4.4725 46.5229 11.9816 47.9063 77.0096 7.1576 10.0007 3.0824 41.8408 2.1213 0.1639 236.9068 0.6367 0.6488 12.7944 0.0095 9.9747 1.4909 1.8634 0.0429 4.5758 7.5077 39.1896 39.2879 0.0010 9.9608 1.3925 772.6609 6.1904 209.0876 87.8390 0.2596 33.3542 87.7348 78.7937 0.6289 53.5368 9.5488 103.8670 4.8155 5.8576 31.4572 324.7930 0.7411 0.1049 15.3729 9.8166 6.4155 3.0087 12.6443 36.7902 22.6709 0.7453 1.0171 1.7888
temp: 298.150 k
press: 1.00000 atm
elementType: 8 8 8 7 7 6 6 6 6 6 6 6 6 6 6 6 6 1 1 1 1 1 1 1 1 1 1
symmnumber: 1
zpe: 522711.7 jmol-1
zpe.correction: 0.199090 hartree
zpe.thermalcorrener: 0.213368 hartree
zpe.thermalcorrenthalpy: 0.214313 hartree
zpe.thermalcorrgfe: 0.153203 hartree
zpe.sumelectzpe: -797.154762 hartree
zpe.sumelectthermal: -797.140484 hartree
zpe.sumelectthermalent: -797.139539 hartree
zpe.sumelectthermalfe: -797.200649 hartree
dipole: 6.0098 0.9041 -0.0030
dipole: 6.0774
quadrupole: -120.7540 -98.3514 -91.1143
quadrupole: -2.5981 0.0355 -0.0325
quadrupole: -17.3474 5.0551 12.2923 -2.5981 0.0355 -0.0325
hfenergy: -797.3538521 hartree
pointgroup: C01 [X(C12H10N2O3)]
dipole: -2.3641369 -0.3572991 0.0160001 debye
polarizability: 276.6933207|11.963062|118.8418319|-0.6757297|-0.471623|104.7304761 unknown
InChI: InChI=1S/C12H10N2O3/c15-14(16)11-6-7-12(13-8-11)17-9-10-4-2-1-3-5-10/h1-8H,9H2
charge 0 multiplicity 1
27 atoms
O  -0.670037 -0.416675 0.006632
O  5.616443 -0.964773 0.025786
O  5.370813 1.306723 -0.056993
N  1.238412 0.97931 -0.045536
N  4.890856 0.106252 -0.01297
C  -2.945905 0.427961 -0.015771
C  -1.499133 0.847157 -0.04084
C  -3.643667 0.178715 -1.224403
C  -3.628817 0.278242 1.217536
C  0.696329 -0.271341 0.001182
C  -4.998822 -0.217948 -1.201749
C  -4.983856 -0.118445 1.244181
C  1.468897 -1.470732 0.046374
C  3.429459 -0.054659 -0.006744
C  -5.671562 -0.367369 0.033484
C  2.862221 -1.355796 0.042017
C  2.593773 1.082046 -0.049167
H  -1.22317 1.391335 -0.960579
H  -1.213959 1.464832 0.828221
H  -3.122936 0.293171 -2.182783
H  -3.096379 0.470359 2.156915
H  0.962461 -2.437558 0.082869
H  -5.52929 -0.407199 -2.141278
H  -5.502541 -0.230324 2.202485
H  3.517168 -2.229925 0.074891
H  -6.723712 -0.672566 0.052209
H  3.026454 2.085703 -0.086569
