program: Gaussian 09
title: 000295667
version: EM64L-G09RevD.01
frameworkgroup: C1[X(C16H20N2)]
method: RPBEPBE
basis: SDD
operation: Freq
keyword: #pfreq=noraman
keyword: PBEPBE/SDD
title: #p freq=noraman PBEPBE/SDD
converged: YES YES NO NO
title: Mulliken charges:
elementType: N N C C C C C C C C C C C C C C C C H H H H H H H H H H H H H H H H H H H H
charge: -0.077787 -0.407228 -0.355935 -0.375212 -0.440219 -0.573331 -0.425951 0.393157 0.415411 -0.383036 0.106461 0.224200 -0.454037 -0.821243 -0.410809 -0.355085 -0.261639 -0.218821 0.187096 0.223687 0.213299 0.183427 0.177974 0.224504 0.219951 0.221801 0.220377 0.195380 0.219777 0.269823 0.229068 0.217657 0.221676 0.302588 0.229689 0.225099 0.218414 0.219821
chargesum: 0.00000
title: Mulliken charges with hydrogens summed into heavy atoms:
elementType: N N C C C C C C C C C C C C C C C C
charge: -0.077787 -0.104640 0.054848 0.021513 -0.037742 -0.131579 -0.010195 0.393157 0.415411 -0.163259 0.106461 0.224200 -0.184214 -0.152842 -0.181121 -0.129987 -0.043225 0.001000
polarizability: 2.33299792e+02 -1.03387673e+01 1.89873929e+02 -7.80027310e+00 9.11381521e+00 1.26739994e+02
1716.lowfreq: -4.1906 -0.0002 -0.0001 0.0007 1.6817 12.3092 21.2333 32.7098 50.3668
frequency: 19.2867 32.0390 50.3664 79.1491 106.2673 142.5547 160.3006 173.5224 207.7528 218.4483 226.7560 261.0826 293.2841 325.1552 369.7337 413.3989 419.0120 423.3647 455.2992 464.1774 493.3363 501.0955 539.2186 575.6592 583.7172 619.3586 641.6900 730.6237 747.3326 747.5061 760.4396 776.0322 787.8639 804.5007 826.8163 848.4446 863.0101 868.7281 915.2860 929.2906 933.1142 968.5084 970.9839 1005.6493 1010.1069 1021.3694 1034.0931 1047.9846 1058.1715 1072.2567 1081.9998 1093.7583 1126.6218 1131.8677 1145.1490 1166.4043 1178.2321 1196.8815 1201.3227 1232.9715 1238.2896 1249.1845 1264.5520 1293.3751 1295.2960 1305.7075 1319.8733 1336.3382 1347.3931 1352.1033 1373.7253 1389.8580 1392.2870 1394.7221 1420.9990 1449.3054 1458.6205 1458.7214 1461.7259 1462.1467 1472.6213 1474.0932 1481.9027 1484.4039 1564.2159 1586.8080 1631.1866 1705.3887 2776.0777 2834.2996 2849.3072 2956.8226 2968.8333 2979.3790 2991.7688 3017.3161 3020.9345 3026.3940 3030.8938 3049.6251 3079.7361 3102.3423 3120.2828 3127.5607 3141.8647 3160.5467 3218.9757 3614.2213
redmass: 3.8744 3.9679 4.0609 3.1758 2.9493 2.4317 1.2150 3.6010 2.0147 3.9214 2.8520 2.0901 2.9524 3.1745 2.5825 3.1178 2.4595 2.8503 3.6128 3.6230 3.3523 1.3871 5.9800 3.0973 4.6122 2.8631 2.9374 3.4928 1.5302 2.6353 2.7016 2.1038 1.4205 1.5148 1.6388 1.4895 3.2407 4.3216 2.1218 1.3829 2.2932 1.2985 1.5866 1.8291 2.0943 2.0194 3.0714 1.7019 1.9333 2.8126 2.0768 1.5486 1.7257 1.5125 2.2828 1.1144 1.8770 1.3409 1.5161 1.4398 2.2053 1.4073 1.4278 1.7214 1.3205 1.3877 1.4956 1.5125 1.7416 1.5408 1.8112 3.1031 1.7683 1.2590 2.3434 1.0920 1.7043 1.4949 1.2017 1.0598 1.0650 1.0953 2.9085 1.1154 6.2811 6.2160 6.8948 6.7394 1.0713 1.0705 1.0705 1.0377 1.0600 1.0646 1.0799 1.0979 1.0883 1.0967 1.0895 1.1003 1.0977 1.0917 1.0848 1.0889 1.0952 1.1001 1.0983 1.0808
irintensity: 0.3446 0.6034 0.7411 0.1673 0.6520 0.3540 1.0020 1.4170 1.6280 8.0868 0.4098 6.4903 1.3844 1.0446 3.8087 1.1664 4.7585 11.6530 3.4661 1.2612 10.7179 86.7643 0.8106 7.9734 7.3991 2.3801 0.9021 2.0941 86.9280 25.4930 4.1380 15.6388 4.6464 10.7057 21.2431 0.1844 2.6684 4.7471 1.0362 2.0282 8.6764 0.2760 8.5452 0.5731 11.3888 5.4093 12.7391 10.2958 16.6067 2.0966 29.3765 41.1357 26.2470 6.7865 7.0787 0.8987 11.2547 12.1211 11.6405 13.2479 13.4136 6.5898 2.9614 1.4449 3.0640 3.9046 5.8825 7.2385 11.2549 32.4307 2.0634 23.1851 13.5543 11.0496 2.9769 7.4034 2.2115 21.1509 6.3924 11.3885 13.7235 2.3468 3.6709 14.3379 1.9212 0.2074 2.2450 3.4982 79.5116 50.7384 162.9360 45.0280 48.3123 21.1364 45.4398 34.1971 13.4389 29.7448 50.2432 36.5167 28.0478 46.5995 3.5559 4.2298 42.8780 30.0812 1.3809 59.5725
temp: 298.150 k
press: 1.00000 atm
elementType: 7 7 6 6 6 6 6 6 6 6 6 6 6 6 6 6 6 6 1 1 1 1 1 1 1 1 1 1 1 1 1 1 1 1 1 1 1 1
symmnumber: 1
zpe: 848214.4 jmol-1
zpe.correction: 0.323068 hartree
zpe.thermalcorrener: 0.339547 hartree
zpe.thermalcorrenthalpy: 0.340491 hartree
zpe.thermalcorrgfe: 0.277694 hartree
zpe.sumelectzpe: -729.862093 hartree
zpe.sumelectthermal: -729.845613 hartree
zpe.sumelectthermalent: -729.844669 hartree
zpe.sumelectthermalfe: -729.907466 hartree
dipole: -0.9210 -1.3141 -0.0378
dipole: 1.6052
quadrupole: -95.8061 -98.1656 -110.7224
quadrupole: 11.2184 1.6676 1.3758
quadrupole: 5.7586 3.3991 -9.1577 11.2184 1.6676 1.3758
hfenergy: -730.1851604 hartree
pointgroup: C01 [X(C16H20N2)]
dipole: 0.3466548 -0.5262112 0.0421076 debye
polarizability: 233.6825219|8.3283144|188.0037099|-9.8414407|-12.6072817|128.2274841 unknown
InChI: InChI=1S/C16H20N2/c1-13-5-4-9-18(12-13)10-8-14-11-17-16-7-3-2-6-15(14)16/h2-3,5-7,11,17H,4,8-10,12H2,1H3
charge 0 multiplicity 1
38 atoms
N  -2.343473 -0.564799 -0.176949
N  3.471129 -1.851886 0.635022
C  -0.881444 -0.641209 -0.40219
C  -3.122817 -0.898105 -1.394823
C  -2.760809 0.734735 0.400074
C  -0.066769 -0.624043 0.919507
C  -4.6121 -1.078318 -1.043451
C  -4.269072 0.933126 0.439371
C  1.408042 -0.855621 0.69847
C  -5.110646 0.085983 -0.210008
C  2.364655 0.080184 0.125055
C  3.649839 -0.571762 0.098821
C  2.122831 -2.015996 0.994998
C  -4.750391 2.120285 1.249508
C  2.263591 1.412534 -0.358989
C  4.812099 0.062634 -0.393731
C  3.418621 2.052121 -0.84881
C  4.679421 1.383618 -0.8680
H  -0.520825 0.18598 -1.068763
H  -0.667492 -1.591521 -0.926229
H  -2.714757 -1.833352 -1.820778
H  -3.024396 -0.102382 -2.178761
H  -2.302158 1.595924 -0.16422
H  -2.372143 0.807249 1.435009
H  -0.211454 0.346697 1.433312
H  -0.487103 -1.403103 1.582361
H  -4.749434 -2.028597 -0.48853
H  -5.205577 -1.163344 -1.975894
H  -6.196485 0.240818 -0.140772
H  1.769971 -2.944674 1.440716
H  -5.846487 2.23431 1.188007
H  -4.288859 3.063496 0.893738
H  -4.476359 2.016704 2.318573
H  4.20268 -2.547743 0.758295
H  1.301274 1.937171 -0.349307
H  5.783291 -0.44518 -0.40847
H  3.354643 3.079815 -1.2237
H  5.559858 1.907348 -1.257155
