program: Gaussian 09
title: 000295652
version: EM64L-G09RevD.01
frameworkgroup: C1[X(C10H11NO)]
method: RPBEPBE
basis: SDD
operation: Freq
keyword: #p
keyword: freq=noraman
keyword: PBEPBE/SDD
title: #p freq=noraman PBEPBE/SDD
converged: YES YES NO NO
title: Mulliken charges:
elementType: O N C C C C C C C C C C H H H H H H H H H H H
charge: -0.442508 -0.214567 0.230046 0.347259 0.302189 -0.548899 -0.357850 -0.476601 -0.671751 -0.411443 -0.226650 -0.249017 0.262242 0.227594 0.220492 0.233969 0.233752 0.288615 0.232746 0.237278 0.220405 0.220598 0.342099
chargesum: 0.00000
title: Mulliken charges with hydrogens summed into heavy atoms:
elementType: O N C C C C C C C C C C
charge: -0.100410 -0.214567 0.230046 0.347259 0.302189 -0.286657 -0.123881 -0.028515 0.083363 -0.174165 -0.006245 -0.028419
polarizability: 1.74488711e+02 3.65889377e-01 1.20872520e+02 6.12477782e+00 3.11986468e-01 6.19371588e+01
1716.lowfreq: -11.0469 -5.7281 -0.0006 -0.0002 0.0007 1.1917 77.0277 109.7804 127.4099
frequency: 77.0239 109.7802 127.3978 149.0359 208.0261 251.3328 268.4343 284.8477 364.6544 386.3013 438.7928 508.1228 515.2698 563.2171 576.3033 621.1458 699.2764 715.8547 742.9571 756.5842 799.4255 834.2650 854.0307 894.0186 914.4869 933.1440 961.2786 971.8567 1010.7630 1095.1701 1122.0005 1133.0158 1136.3118 1150.9237 1167.2654 1193.3340 1245.0673 1288.9886 1319.8748 1342.1454 1365.2613 1391.1224 1414.5901 1439.2118 1463.3348 1470.8537 1479.4483 1487.9507 1497.9654 1550.2606 1583.2463 1626.4601 2977.9395 2995.2507 3060.4423 3061.7044 3109.8109 3124.3811 3133.7471 3147.1843 3163.0657 3211.4626 3552.1053
redmass: 4.5957 3.7112 1.4620 1.8965 4.2266 2.8300 4.1254 2.2055 2.8516 1.4785 3.1287 3.2698 5.2428 5.1689 3.5753 4.4858 4.0163 4.9839 1.3190 2.9359 1.5273 3.3029 1.5366 4.5481 4.3038 1.3848 1.7110 1.3017 2.1232 2.4413 1.3037 1.2650 1.3212 1.9373 1.1028 1.6878 2.1682 1.3037 1.7820 3.2391 1.2241 3.5804 3.4325 1.6864 1.2285 2.0708 2.3176 1.1744 1.0944 6.6879 6.5173 7.4069 1.0370 1.0620 1.1012 1.1000 1.0998 1.0846 1.0889 1.0953 1.1002 1.0977 1.0662
irintensity: 1.4715 2.8091 2.1271 7.6141 6.2462 0.6465 0.7846 8.0535 30.0356 158.3339 6.6990 6.1029 7.1018 9.0977 0.1272 3.1137 17.0706 0.7352 41.6410 32.4842 68.4710 6.3738 4.3895 13.4896 96.4965 3.7486 1.6813 0.0504 8.5366 2.7864 3.5564 5.9824 19.5662 32.3261 1.8657 13.0432 3.0561 20.9628 7.0167 11.3869 61.5397 38.6480 26.1197 0.7914 20.3892 9.6501 48.6564 4.0137 15.5208 9.5205 0.4328 3.8635 64.6712 55.9908 14.5448 31.9544 0.6058 0.1804 5.1355 37.1492 30.6781 3.7698 5.3022
temp: 298.150 k
press: 1.00000 atm
elementType: 8 7 6 6 6 6 6 6 6 6 6 6 1 1 1 1 1 1 1 1 1 1 1
symmnumber: 1
zpe: 490699.3 jmol-1
zpe.correction: 0.186898 hartree
zpe.thermalcorrener: 0.197518 hartree
zpe.thermalcorrenthalpy: 0.198462 hartree
zpe.thermalcorrgfe: 0.150901 hartree
zpe.sumelectzpe: -516.766963 hartree
zpe.sumelectthermal: -516.756343 hartree
zpe.sumelectthermalent: -516.755399 hartree
zpe.sumelectthermalfe: -516.802960 hartree
dipole: -0.2804 0.3660 -0.0245
dipole: 0.4617
quadrupole: -74.7056 -61.0561 -72.5157
quadrupole: 2.2407 1.7054 -1.3090
quadrupole: -5.2798 8.3697 -3.0899 2.2407 1.7054 -1.3090
hfenergy: -516.9538609 hartree
pointgroup: C01 [X(C10H11N1O1)]
dipole: 0.1050042 0.1481363 0.005107 debye
dipolederiv: -0.937621 0.134758 0.1868795 0.0716103 -0.3990573 0.154379 0.3893401 0.1839195 -0.5128885 -0.5281848 -0.0025925 -0.060626 -0.2781957 -0.7002389 -0.0214763 -0.0239863 0.0692576 -0.130124 0.4011366 0.1296746 0.0500849 0.3880024 -0.1284147 0.0379295 0.0091692 0.0069596 0.0401446 -0.3710015 -0.1109084 0.0577887 0.0691381 0.6284338 0.034504 -0.0275573 -0.0062896 -0.1295336 0.0762758 0.0294133 0.0193646 -0.3650768 -0.1580043 -0.0279928 0.0067989 0.0090717 0.025645 -0.1214541 -0.2138322 0.0071026 0.0056655 -0.1484244 -0.0229734 0.0454159 -0.0384852 -0.2875882 0.025453 -0.1075885 0.013483 -0.0416638 0.0522674 0.0010801 0.0247813 -0.0153419 -0.2000804 0.8271452 0.0322914 -0.1134199 -0.0191263 0.3302459 -0.0934801 -0.2186741 -0.1252657 0.5406949 0.1330033 0.1599116 0.0308396 0.2354556 0.4854164 0.0604549 0.0056601 0.0262678 0.2232375 0.1420888 -0.0401556 0.0199901 0.051775 0.1277214 -0.0100501 0.0217838 -0.0150886 -0.172024 -0.1031605 0.0190599 0.0150904 -0.0922343 0.1262325 -0.0155266 0.0117527 -0.0062554 -0.1828853 -0.0300366 0.0901773 0.0123301 0.181368 -0.1075177 0.002347 0.0056215 0.003957 -0.1889778 0.0579975 0.0433349 -0.0131348 0.0684474 -0.0404659 0.0141237 -0.0141073 0.0154816 0.1923952 -0.0674496 -0.0343863 -0.0312456 -0.1305287 0.0287108 -0.1134056 -0.0021292 -0.0551926 -0.0520134 0.0307115 0.0031226 0.0237959 0.09206 -0.1585008 0.1045567 0.0170417 0.0442893 0.0295854 0.0844664 -0.0557794 -0.005794 -0.0084063 -0.1044412 0.0052419 -0.0114603 0.0028988 0.1694611 0.0835279 0.0041205 0.0365145 -0.0828115 -0.0672416 -0.0693206 -0.0194704 -0.1425223 -0.1035374 -0.0284496 -0.0686952 0.0159084 0.0164869 0.122804 -0.0110466 0.0061192 -0.0000356 0.1125579 0.0735479 0.1016218 -0.0969112 -0.0217232 -0.0400493 0.055342 -0.0496732 0.0963132 -0.0090118 0.0745013 -0.0097034 -0.0065819 -0.0540956 -0.114043 0.007246 -0.0047651 0.0102902 0.1599836 -0.0675877 0.1059864 -0.0216137 0.1120205 0.004214 0.0147157 -0.0225437 0.0139262 0.1609083 -0.1313084 -0.0814835 -0.0194371 -0.0807697 0.0544954 -0.0024127 -0.0196107 -0.0031001 0.1644485 0.3763987 -0.1283473 -0.120408 -0.1173981 0.2058575 -0.1042357 -0.1295067 -0.0750553 0.1496026 unknown
polarizability: 174.5023015|1.7587502|120.8701686|5.5142297|-1.6890932|61.9259204 unknown
InChI: InChI=1S/C10H11NO/c1-11-9(7-12)6-8-4-2-3-5-10(8)11/h2-6,12H,7H2,1H3
charge 0 multiplicity 1
23 atoms
O  3.775415 0.077921 -0.751518
N  0.863806 0.793705 0.170447
C  -0.506377 0.519316 0.073558
C  1.561939 -0.429198 0.280105
C  -0.676324 -0.913203 0.116863
C  0.644313 -1.484899 0.243994
C  -1.603174 1.402873 -0.049643
C  3.052451 -0.490226 0.418093
C  1.458597 2.134224 0.180759
C  -1.985971 -1.456162 0.031917
C  -2.890574 0.834596 -0.131712
C  -3.080704 -0.579362 -0.09189
H  0.898538 -2.542026 0.309423
H  3.422647 0.119235 1.261119
H  3.351868 -1.541749 0.592513
H  -1.469215 2.489682 -0.073488
H  1.337271 2.623793 1.165688
H  2.529091 2.058026 -0.065033
H  0.976948 2.765053 -0.587362
H  -2.141667 -2.540409 0.062353
H  -3.763129 1.490937 -0.225365
H  -4.097208 -0.982998 -0.157867
H  3.43716 -0.370227 -1.568855
