program: Gaussian 09
title: 000295672
version: EM64L-G09RevD.01
frameworkgroup: C1[X(C14H15N3O2S)]
method: RPBEPBE
basis: SDD
operation: Freq
keyword: #p
keyword: freq=noraman
keyword: PBEPBE/SDD
title: #p freq=noraman PBEPBE/SDD
converged: YES YES NO NO
title: Mulliken charges:
elementType: S O O N N N C C C C C C C C C C C C C C H H H H H H H H H H H H H H H
charge: 0.297143 -0.279141 -0.323366 -0.457669 -0.031400 0.032738 0.195653 0.010635 0.430965 -0.449043 -0.334814 -0.358957 0.235676 -0.394972 -0.199193 -0.218733 -0.221446 -0.257247 -0.671292 -0.836384 0.374838 0.238721 0.305660 0.284491 0.227820 0.223585 0.231694 0.231957 0.229499 0.214877 0.232605 0.232667 0.276397 0.277240 0.248799
chargesum: 0.00000
title: Mulliken charges with hydrogens summed into heavy atoms:
elementType: S O O N N N C C C C C C C C C C C C C C
charge: 0.297143 -0.279141 -0.323366 -0.082831 -0.031400 0.032738 0.195653 0.010635 0.430965 -0.210323 -0.029154 -0.074466 0.235676 -0.394972 0.028627 0.004851 0.242204 -0.027749 0.008857 -0.033948
polarizability: 3.15095862e+02 -1.98615739e+00 2.76030859e+02 1.04756014e-01 -1.82027772e-01 8.78527936e+01
1716.lowfreq: -3.3683 0.0007 0.0015 0.0020 3.0368 4.9143 23.3354 34.5257 45.5584
frequency: 23.2497 34.5090 45.5500 57.4391 70.4059 91.0288 98.3372 106.8707 123.3371 165.5360 175.8024 188.7709 202.2938 239.2964 243.4280 263.3260 297.3572 299.8150 330.7479 354.7742 381.7825 409.3195 433.4719 491.6253 514.3778 514.6312 577.7362 615.8930 646.6346 660.0585 667.9687 697.2954 706.2704 712.3825 767.3978 782.3196 792.9921 797.8844 832.1643 832.8578 844.1053 908.7149 930.0392 938.3685 956.9504 977.3530 981.7512 986.0643 995.4569 999.8260 1010.8812 1026.2911 1042.3416 1086.0523 1112.9929 1135.1741 1137.3414 1170.9165 1185.9263 1194.3310 1244.5730 1247.5853 1284.0111 1299.5646 1322.2387 1337.5916 1356.0419 1369.3867 1383.7053 1402.2348 1414.6902 1435.2526 1440.6158 1451.5960 1457.8207 1464.0240 1472.8406 1486.0753 1489.5754 1524.5297 1569.6699 1584.7438 1615.5915 1647.5695 2997.2642 3012.9008 3019.2940 3072.5888 3094.1723 3109.8844 3120.8114 3130.7931 3143.5611 3144.9984 3147.4821 3165.3599 3168.0960 3206.1453 3212.7647
redmass: 3.0700 3.6549 3.6463 3.6157 4.6438 4.7892 4.8362 5.4370 3.5821 3.6925 1.0840 6.0199 5.1723 4.9213 1.5347 2.9564 6.2942 5.9309 6.4187 7.8400 4.2969 2.9447 3.6664 8.0902 3.2042 7.1540 8.2935 6.5049 10.6127 6.5408 7.4414 2.0117 8.6167 9.1474 1.7206 5.5664 6.7630 1.1111 5.2821 4.7584 1.2796 1.2251 1.3555 5.4423 1.4442 1.3218 1.2011 5.9774 1.3845 1.2999 2.6259 2.1413 5.7227 1.5552 2.2525 1.4611 5.2542 1.0666 1.1782 4.7285 2.7542 1.1366 2.0948 8.0219 1.4273 1.3919 1.5110 2.1265 4.8320 1.2915 4.5452 3.1156 1.0529 2.8794 1.0858 1.0400 1.0653 1.1054 2.3996 6.2816 7.8567 5.8784 6.1781 1.7761 1.0359 1.0581 1.0281 1.1068 1.0985 1.1029 1.0875 1.0877 1.1038 1.0940 1.1059 1.1004 1.0930 1.0810 1.0933
irintensity: 0.3848 0.1465 1.4861 0.4068 0.3711 0.7880 0.8314 0.2545 3.4012 1.9790 0.0044 0.0170 6.2987 0.6756 1.1848 5.4401 11.5768 4.3500 0.6070 17.9034 4.1403 0.0003 0.2336 12.4210 13.6967 19.3983 11.4093 2.2942 2.0231 4.6554 0.1420 39.3888 0.0051 5.2003 63.1654 0.7154 3.7820 3.3521 1.7690 11.5383 5.0272 34.0690 70.4283 28.9035 8.4954 0.0107 8.9648 1.6724 8.0231 1.0840 7.2118 6.5663 215.5449 10.2600 15.6620 9.1771 698.6719 1.0269 2.5842 40.5254 36.0701 0.0139 425.9771 22.5134 15.1298 104.0448 127.5709 67.0788 33.8177 27.6985 177.9783 93.3436 15.2354 41.9521 25.7508 12.8387 5.5858 2.8382 73.8795 172.7955 1026.7340 146.1922 26.0750 219.7691 22.3795 18.4558 15.2312 6.7975 27.9955 41.5711 6.9545 2.3913 16.8538 23.1396 11.0382 32.9258 2.3363 210.3625 8.4359
temp: 298.150 k
press: 1.00000 atm
elementType: 16 8 8 7 7 7 6 6 6 6 6 6 6 6 6 6 6 6 6 6 1 1 1 1 1 1 1 1 1 1 1 1 1 1 1
symmnumber: 1
zpe: 705291.1 jmol-1
zpe.correction: 0.268631 hartree
zpe.thermalcorrener: 0.287936 hartree
zpe.thermalcorrenthalpy: 0.288880 hartree
zpe.thermalcorrgfe: 0.218787 hartree
zpe.sumelectzpe: -1253.828192 hartree
zpe.sumelectthermal: -1253.808888 hartree
zpe.sumelectthermalent: -1253.807944 hartree
zpe.sumelectthermalfe: -1253.878037 hartree
dipole: -0.5624 -2.6914 0.0160
dipole: 2.7496
quadrupole: -93.3646 -129.9881 -128.3655
quadrupole: 9.8847 0.0166 -0.0601
quadrupole: 23.8748 -12.7487 -11.1261 9.8847 0.0166 -0.0601
hfenergy: -1254.0968237 hartree
pointgroup: C01 [X(C14H15N3O2S1)]
dipole: -0.0192814 1.0771162 0.0982951 debye
polarizability: 314.342282|-4.822024|274.9275622|-5.5985193|18.045474|89.7096704 unknown
InChI: InChI=1S/C14H15N3O2S/c1-3-19-13(18)11-9-15-14(20-2)17-12(11)16-10-7-5-4-6-8-10/h4-9,16H,3H2,1-2H3
charge 0 multiplicity 1
35 atoms
S  0.477168 -4.293837 -0.450991
O  -3.677585 0.856695 0.144763
O  -1.735315 2.136746 0.228688
N  0.600104 0.814302 0.049319
N  0.496778 -1.562945 -0.180636
N  -1.661241 -2.716339 -0.246918
C  -0.128643 -0.344102 -0.04763
C  -1.58194 -0.27904 -0.009889
C  2.000115 1.055314 0.03932
C  2.397005 2.418526 0.151083
C  2.99405 0.046411 -0.071822
C  -2.274238 -1.512439 -0.115449
C  -2.297102 0.995582 0.129394
C  -0.286729 -2.662366 -0.27183
C  3.761356 2.766054 0.150493
C  4.357794 0.411365 -0.070423
C  -4.469494 2.120288 0.283892
C  4.754087 1.763556 0.039423
C  -5.939483 1.71718 0.261976
C  2.300757 -3.844277 -0.45517
H  -0.011611 1.65142 0.143897
H  1.631835 3.200027 0.237394
H  2.681779 -0.993695 -0.156903
H  -3.367479 -1.518747 -0.092904
H  4.049543 3.819454 0.23679
H  5.117958 -0.373664 -0.156447
H  -4.1749 2.608637 1.230077
H  -4.197923 2.79099 -0.55086
H  5.815429 2.033432 0.038986
H  -6.572282 2.617242 0.36627
H  -6.199121 1.218796 -0.687407
H  -6.173767 1.030518 1.09309
H  2.569466 -3.362935 0.496017
H  2.517324 -3.172731 -1.298213
H  2.837307 -4.79872 -0.571876
