program: Gaussian 09
title: 000027240
version: EM64L-G09RevD.01
frameworkgroup: C1[X(C15H17NO3)]
method: RPBEPBE
basis: SDD
operation: Freq
keyword: #p
keyword: freq=noraman
keyword: PBEPBE/SDD
title: #p freq=noraman PBEPBE/SDD
converged: YES YES NO NO
title: Mulliken charges:
elementType: O O O N C C C C C C C C C C C C C C C H H H H H H H H H H H H H H H H H
charge: -0.304550 -0.464379 -0.337457 -0.708082 -0.291830 -0.332434 0.533418 0.183743 -0.467070 -0.366196 0.301527 -0.300078 -0.549564 -0.218231 -0.241004 0.555676 -0.442043 -0.245063 -0.531088 0.212279 0.217674 0.223949 0.225009 0.273969 0.238773 0.233975 0.221565 0.220135 0.392849 0.219019 0.223541 0.307814 0.304128 0.228339 0.228676 0.253010
chargesum: 0.00000
title: Mulliken charges with hydrogens summed into heavy atoms:
elementType: O O O N C C C C C C C C C C C C C C C
charge: -0.304550 -0.071530 -0.337457 -0.096140 -0.079551 0.109190 0.533418 0.183743 -0.242061 -0.092227 0.301527 -0.061305 -0.315589 0.003334 -0.020869 0.555676 -0.223023 -0.021523 0.178936
polarizability: 2.63887011e+02 -1.99535081e+00 1.60007149e+02 -2.31570279e+00 -9.11526600e+00 1.21525799e+02
1716.lowfreq: -8.2312 -1.1852 -0.0011 -0.0007 -0.0005 6.4220 15.9026 24.6861 36.9531
frequency: 15.6786 24.1571 36.8500 78.2539 86.4930 99.8869 132.5622 184.4114 190.8875 203.5008 215.6596 231.9301 272.1336 292.4101 311.3179 327.2273 332.5428 352.1534 371.9053 397.5714 402.0199 442.9749 484.9074 508.2061 532.3102 542.3166 560.8606 615.1884 621.2852 669.6801 692.0696 706.6217 710.1879 712.4362 736.4305 772.8352 794.4460 799.4557 827.3228 852.9896 872.5593 915.1313 920.4251 923.1456 932.2937 975.1162 989.1359 993.1509 995.4733 1016.4339 1032.4486 1041.2060 1049.7350 1081.9103 1108.7551 1117.0598 1151.0582 1170.2044 1170.5214 1188.6009 1192.0797 1209.3558 1234.7542 1258.3726 1269.9434 1306.4168 1331.6931 1343.2695 1355.1879 1377.2414 1387.0257 1402.2138 1427.8302 1438.4607 1442.2956 1454.7847 1467.5046 1472.4919 1482.6184 1507.9641 1585.9767 1592.7068 1612.9273 1629.4764 1644.0851 2971.9578 2987.5863 3012.6979 3065.9809 3066.4824 3109.6359 3121.2881 3129.5815 3130.4139 3135.2868 3146.4512 3153.6553 3156.3986 3167.0029 3316.2012 3572.5107 3712.6365
redmass: 4.6653 4.4143 4.7785 4.8668 3.3607 5.1491 4.3899 4.1345 2.7405 2.9941 2.5715 4.7808 2.0156 5.1967 3.3452 1.1626 4.6912 1.1262 3.1887 4.7831 2.8283 3.4011 3.5524 4.0602 5.8289 4.1223 3.6643 6.2005 3.1885 5.2111 1.2800 3.1650 5.8365 1.3599 3.3602 2.1218 3.5651 1.5719 2.0405 1.2487 3.6328 1.9676 3.5951 1.4778 2.3475 1.4050 4.1555 1.4490 3.9541 3.1226 2.4485 1.5682 2.2599 1.6121 2.4340 1.2596 1.3966 1.2046 1.3829 1.6134 1.1463 2.0655 1.2786 1.5087 1.4461 1.5152 2.8875 1.4353 1.3280 5.4048 5.1259 1.1952 1.5102 1.1077 2.0861 2.1236 1.0528 1.0832 2.2774 3.2049 7.5747 5.9930 6.0281 3.3778 1.3861 1.0319 1.0582 1.0826 1.1085 1.1052 1.0867 1.0868 1.0996 1.0890 1.0930 1.0905 1.0975 1.0964 1.0976 1.0685 1.0449 1.1040
irintensity: 1.4115 0.8407 1.0606 2.0957 5.0665 2.5274 6.0670 1.6413 1.9379 2.9787 0.5106 4.5002 3.2264 2.8184 2.5908 179.2499 3.0022 125.5064 7.7315 3.6860 0.4072 2.7667 4.2031 1.7483 2.7523 1.1819 19.8346 1.0631 16.1828 5.0594 141.8123 1.3176 1.9325 203.9600 2.6246 26.7055 11.2230 18.1674 76.0474 0.8796 67.3462 20.9739 2.6179 6.1357 26.0667 0.5789 0.6596 0.4812 39.3969 8.8295 28.5025 15.7497 29.7387 9.5224 88.0476 0.1083 2.3966 7.1400 17.5825 32.7178 16.7465 167.3521 78.5901 2.8282 25.9534 13.5710 26.1101 6.4877 13.5959 23.7035 2.0480 37.3179 1.1746 13.8534 10.8830 21.0011 14.7190 55.6684 19.5218 251.5014 39.4164 0.3432 2.8098 43.4059 267.2418 57.1749 19.3952 65.3903 25.8092 44.3551 9.1723 1.2986 24.3519 9.1367 37.6282 18.4175 37.5676 8.1102 10.6815 435.4499 78.1368 20.3949
temp: 298.150 k
press: 1.00000 atm
elementType: 8 8 8 7 6 6 6 6 6 6 6 6 6 6 6 6 6 6 6 1 1 1 1 1 1 1 1 1 1 1 1 1 1 1 1 1
symmnumber: 1
zpe: 760638.9 jmol-1
zpe.correction: 0.289712 hartree
zpe.thermalcorrener: 0.307833 hartree
zpe.thermalcorrenthalpy: 0.308777 hartree
zpe.thermalcorrgfe: 0.242096 hartree
zpe.sumelectzpe: -860.788894 hartree
zpe.sumelectthermal: -860.770773 hartree
zpe.sumelectthermalent: -860.769829 hartree
zpe.sumelectthermalfe: -860.836510 hartree
dipole: -5.1324 0.9705 -0.3627
dipole: 5.2359
quadrupole: -79.4058 -95.2405 -120.7262
quadrupole: -7.4603 -2.0757 -3.6201
quadrupole: 19.0517 3.2170 -22.2687 -7.4603 -2.0757 -3.6201
hfenergy: -861.0786061 hartree
pointgroup: C01 [X(C15H17N1O3)]
dipole: 2.0076043 0.161043 -0.4324946 debye
polarizability: 260.0787581|21.2748004|140.5661852|-8.3651775|19.8396249|144.7750151 unknown
InChI: InChI=1S/C15H17NO3/c1-18-15-9-12(16)7-8-14(15)19-10-13(17)11-5-3-2-4-6-11/h2-9,13,17H,10,16H2,1H3
charge 0 multiplicity 1
36 atoms
O  0.044436 1.146418 0.275838
O  -0.415565 -1.518584 1.451916
O  1.279358 -1.081615 -0.718858
N  5.677805 1.1156 -0.320136
C  -1.336547 -0.397707 1.666533
C  -0.568501 0.944475 1.619236
C  -2.558559 -0.450138 0.748033
C  1.455994 1.127425 0.199383
C  -3.854117 -0.572898 1.30808
C  -2.425551 -0.408698 -0.665692
C  2.11653 -0.0006 -0.366297
C  2.233216 2.237688 0.58529
C  3.515152 -0.00621 -0.544489
C  -4.999599 -0.64477 0.481766
C  -3.567955 -0.481283 -1.491865
C  4.290691 1.121198 -0.145837
C  3.633552 2.245677 0.426328
C  -4.859114 -0.598803 -0.923358
C  1.895929 -2.269781 -1.318727
H  -1.683593 -0.523281 2.710788
H  -1.257187 1.792431 1.789973
H  0.227815 0.937942 2.387891
H  -3.967505 -0.621272 2.398898
H  -1.430398 -0.301734 -1.10856
H  1.719421 3.111345 1.001256
H  4.019314 -0.874933 -0.980274
H  -5.994337 -0.741868 0.9320
H  -3.453659 -0.442311 -2.581582
H  0.080738 -1.374425 0.591674
H  4.215677 3.122233 0.732516
H  -5.74349 -0.656446 -1.568451
H  6.237121 1.913893 -0.036498
H  6.153855 0.313683 -0.721006
H  2.621577 -2.735612 -0.62533
H  2.391113 -2.012697 -2.273347
H  1.061679 -2.962043 -1.503993
