program: Gaussian 09
title: 000295642
version: EM64L-G09RevD.01
frameworkgroup: C1[X(C14H16N2O)]
method: RPBEPBE
basis: SDD
operation: Freq
keyword: #p
keyword: freq=noraman
keyword: PBEPBE/SDD
title: #p freq=noraman PBEPBE/SDD
converged: YES YES NO NO
title: Mulliken charges:
elementType: O N N C C C C C C C C C C C C C C H H H H H H H H H H H H H H H H
charge: -0.293449 -0.122999 -0.429725 -0.366567 -0.443148 -0.400110 -0.521640 -0.503694 0.213576 0.341127 0.112128 0.233210 -0.418320 -0.409136 -0.353895 -0.253931 -0.220105 0.233422 0.226566 0.228059 0.231712 0.249655 0.217508 0.244153 0.250910 0.211820 0.225661 0.322503 0.304356 0.227070 0.226601 0.217404 0.219277
chargesum: 0.00000
title: Mulliken charges with hydrogens summed into heavy atoms:
elementType: O N N C C C C C C C C C C C C C C
charge: -0.293449 -0.122999 -0.125368 0.093422 0.016624 0.067053 -0.026577 -0.066213 0.213576 0.341127 0.112128 0.233210 -0.095817 -0.182066 -0.127294 -0.036528 -0.000828
polarizability: 1.98373893e+02 -1.25564677e+01 1.66313463e+02 1.95357971e+01 3.86100512e+00 1.14851631e+02
1716.lowfreq: -13.0562 -0.0007 0.0005 0.0008 2.0236 6.7029 21.4390 37.2073 75.1408
frequency: 21.3678 37.0786 75.1082 107.5392 126.3476 148.4412 155.5314 198.2247 227.6553 241.1791 304.1210 322.6259 387.1196 423.0409 465.0100 489.6668 513.7365 548.1179 552.2319 576.8301 587.2647 599.2415 614.6432 635.8017 688.4867 720.3359 746.9190 759.2403 760.5855 838.1791 847.1141 857.2803 869.3637 894.8366 914.4067 925.9045 928.7108 947.3759 967.3153 984.6130 1010.5107 1035.5815 1044.2636 1073.9204 1090.9374 1106.5607 1135.0354 1145.7543 1165.9354 1172.9983 1195.6259 1215.6079 1229.6391 1236.4159 1255.6890 1269.6903 1278.9620 1293.7843 1303.7369 1314.4213 1327.1677 1361.6439 1366.2651 1394.4720 1414.8992 1421.5784 1452.2931 1461.3270 1463.9998 1468.7284 1475.3239 1481.1517 1497.3141 1565.0391 1585.9397 1627.3059 1632.4934 2952.9796 2965.9789 2978.5166 2993.2006 3008.5429 3017.3740 3032.9684 3058.2504 3084.4825 3097.7823 3119.6106 3127.4803 3141.4841 3160.1243 3188.0156 3613.9994
redmass: 4.2982 4.8550 4.4584 3.9430 4.6478 4.0124 1.8927 2.6264 4.2264 3.8391 3.7633 2.6473 3.3145 2.8466 4.1325 3.6446 1.2474 4.3914 3.5318 3.1226 4.0127 2.9787 3.1647 4.6588 4.1285 2.6231 1.3335 4.3612 4.0807 1.5550 1.6031 1.4311 4.5797 1.4601 2.3223 2.3454 1.4233 2.4089 1.2976 2.3830 2.0934 2.3902 2.8909 1.6715 2.7908 1.7111 1.5399 1.3402 1.0853 1.4475 1.4622 1.2431 2.0140 1.5690 1.6770 2.2223 1.4343 1.5495 1.8815 1.4088 1.6863 1.6935 1.3910 4.3823 2.3994 2.2475 1.0955 2.7456 1.2564 1.1180 1.0967 2.9987 1.1127 5.4674 6.0672 9.0775 6.8203 1.0601 1.0627 1.0656 1.0981 1.0652 1.0756 1.0885 1.0971 1.0989 1.1026 1.0846 1.0887 1.0951 1.1001 1.1016 1.0808
irintensity: 1.6699 3.5587 4.1223 4.7485 1.7742 4.4730 3.5119 2.0543 8.4479 1.9345 2.1826 6.8013 4.6951 10.8257 9.7474 5.4710 95.5790 1.4375 5.6622 7.5237 2.9041 2.2402 4.7852 7.4583 1.0340 5.9757 106.0565 3.3366 6.5948 10.4855 4.2546 27.6205 3.0356 1.6052 14.2148 3.5359 1.1513 1.1409 0.0881 4.3846 10.8250 16.0347 2.1114 0.4943 10.0453 17.2887 5.2793 15.0518 0.3198 5.4022 0.6708 9.7707 28.7744 33.2103 3.4592 57.7591 20.2019 21.5568 1.8478 0.6622 15.6767 19.5549 1.9617 62.2452 50.2925 8.1861 6.1390 20.6242 16.2923 23.2112 12.5027 1.3586 4.5765 1.0331 0.9959 222.8850 45.2831 16.7802 46.2282 72.7466 38.5009 16.7682 15.4395 53.3223 12.1665 13.4743 34.9851 2.7693 3.7248 40.5112 33.4084 29.0490 54.2929
temp: 298.150 k
press: 1.00000 atm
elementType: 8 7 7 6 6 6 6 6 6 6 6 6 6 6 6 6 6 1 1 1 1 1 1 1 1 1 1 1 1 1 1 1 1
symmnumber: 1
zpe: 718485.5 jmol-1
zpe.correction: 0.273657 hartree
zpe.thermalcorrener: 0.288163 hartree
zpe.thermalcorrenthalpy: 0.289107 hartree
zpe.thermalcorrgfe: 0.230875 hartree
zpe.sumelectzpe: -726.611293 hartree
zpe.sumelectthermal: -726.596787 hartree
zpe.sumelectthermalent: -726.595843 hartree
zpe.sumelectthermalfe: -726.654074 hartree
dipole: -0.9234 -1.9527 1.8352
dipole: 2.8344
quadrupole: -98.7274 -92.1466 -100.7612
quadrupole: 13.5717 -3.8833 5.6637
quadrupole: -1.5157 5.0651 -3.5494 13.5717 -3.8833 5.6637
hfenergy: -726.8849495 hartree
pointgroup: C01 [X(C14H16N2O1)]
dipole: 0.4160926 0.1497534 -1.0236858 debye
polarizability: 196.4966238|-7.1313592|135.6209061|23.4096993|26.2385766|147.4214565 unknown
InChI: InChI=1S/C14H16N2O/c17-14-6-3-8-16(14)9-7-11-10-15-13-5-2-1-4-12(11)13/h1-2,4-5,10,15H,3,6-9H2
charge 0 multiplicity 1
33 atoms
O  2.838392 0.614373 2.141267
N  2.650953 -0.385176 0.010349
N  -1.470344 0.995545 1.582489
C  2.932331 -0.0698 -1.404667
C  3.98928 1.068709 -1.313543
C  1.936373 -1.597615 0.426892
C  3.716805 1.723848 0.064849
C  0.494807 -1.713672 -0.127614
C  3.040116 0.617284 0.888687
C  -0.473212 -0.664312 0.366371
C  -1.798998 -0.41773 -0.178393
C  -2.40208 0.631746 0.60451
C  -0.311255 0.215526 1.438895
C  -2.537799 -0.982334 -1.252807
C  -3.700275 1.12158 0.341081
C  -3.83314 -0.497531 -1.521363
C  -4.40823 0.54351 -0.733061
H  2.011094 0.269458 -1.920389
H  3.312053 -0.96295 -1.935426
H  3.904357 1.776275 -2.154462
H  5.004899 0.635685 -1.33134
H  1.928989 -1.590673 1.532066
H  2.515048 -2.484375 0.097038
H  3.017083 2.577972 -0.010057
H  4.622644 2.082213 0.579462
H  0.5263 -1.701628 -1.237036
H  0.125847 -2.725129 0.144446
H  0.548414 0.356369 2.095542
H  -1.599694 1.720045 2.28473
H  -2.11088 -1.78677 -1.863324
H  -4.147748 1.919837 0.944207
H  -4.414208 -0.924364 -2.346698
H  -5.418523 0.898586 -0.965806
