program: Gaussian 09
title: 000295636
version: EM64L-G09RevD.01
frameworkgroup: C1[X(C13H17NO2)]
method: RPBEPBE
basis: SDD
operation: Freq
keyword: #p
keyword: freq=noraman
keyword: PBEPBE/SDD
title: #p freq=noraman PBEPBE/SDD
converged: YES YES NO NO
title: Mulliken charges:
elementType: O O N C C C C C C C C C C C C C H H H H H H H H H H H H H H H H H
charge: -0.432889 -0.275394 -0.123609 -0.124723 -0.403156 -0.542273 0.196954 -0.405240 -0.366604 -0.533700 0.483731 -0.418239 -0.390245 -0.228688 -0.252761 -0.246794 0.252623 0.220384 0.243480 0.216864 0.261491 0.224680 0.254243 0.199959 0.222076 0.235550 0.214322 0.335461 0.227628 0.270213 0.224849 0.231507 0.228297
chargesum: 0.00000
title: Mulliken charges with hydrogens summed into heavy atoms:
elementType: O O N C C C C C C C C C C C C C
charge: -0.097428 -0.275394 -0.123609 0.127901 0.060708 -0.063918 0.196954 0.073683 0.055432 -0.083828 0.483731 -0.190611 -0.120032 -0.003839 -0.021254 -0.018497
polarizability: 1.49529770e+02 5.23297688e+00 1.51076091e+02 -1.59262208e+01 4.30139221e+00 1.25388054e+02
1716.lowfreq: -14.8293 -8.6193 -4.7527 0.0002 0.0006 0.0006 15.3675 32.6510 48.4699
frequency: 15.1712 32.5387 48.4526 52.2061 101.0028 115.4124 130.6559 167.8967 228.5323 240.6256 286.9633 297.0276 307.2618 344.6997 396.1989 405.2456 453.8321 465.2863 497.7432 549.0416 574.9691 616.5091 624.9862 666.4014 704.5221 737.8812 753.1970 772.6393 834.7502 857.0625 882.4649 894.7932 924.7291 932.4151 957.1236 967.9196 978.1991 989.8270 992.4274 1000.2652 1010.2123 1029.8100 1052.8035 1061.8433 1099.5477 1102.3636 1141.1158 1155.1867 1172.7636 1179.1143 1198.0347 1211.4639 1213.5800 1230.5441 1236.9578 1267.5949 1282.1932 1293.6431 1309.0478 1322.6432 1343.9950 1353.6651 1367.1337 1378.3744 1382.2582 1414.6137 1438.5323 1448.5096 1459.3627 1469.5509 1473.5814 1488.6015 1494.1666 1591.9227 1615.3345 1634.9147 2948.7458 2961.7984 2962.4641 2977.5561 3007.9646 3010.8754 3013.3847 3051.0453 3057.5824 3062.7461 3073.8056 3108.3460 3123.6164 3133.6067 3144.5407 3161.6356 3565.7061
redmass: 5.3012 4.3482 4.2568 4.1006 5.4018 2.3823 3.5760 4.4050 3.1507 2.4319 1.7663 1.7970 2.4484 2.3799 3.3051 2.8496 3.3353 3.0909 3.8061 3.5342 3.3900 6.2008 3.7550 4.4281 2.2735 1.4610 3.6111 3.7508 2.3008 1.2466 1.7138 1.6931 1.8056 1.7412 2.3026 2.8217 1.4775 2.9225 2.6824 1.5970 2.5707 2.1711 1.8002 2.3245 1.8062 1.7494 1.1429 1.2960 1.0574 1.5326 1.1666 2.1164 1.3403 1.3912 1.5852 2.1566 1.7907 1.5735 1.3435 1.4717 1.2976 1.4197 1.3440 1.2579 5.4233 2.3372 1.9582 1.0920 1.1600 1.0824 1.1045 2.1100 1.1194 5.8373 5.9098 9.8094 1.0681 1.0600 1.0603 1.0655 1.0693 1.0965 1.0990 1.0878 1.0954 1.0997 1.0970 1.0874 1.0862 1.0915 1.0960 1.1015 1.0661
irintensity: 0.2493 0.2136 0.5186 2.9354 5.5663 9.1598 3.7536 1.5149 1.4869 8.2807 44.4206 112.6268 6.9016 22.5509 3.1617 0.1564 1.4882 13.7397 3.6676 2.6147 7.4385 1.3495 2.6679 7.6344 35.6305 62.9732 3.0406 6.2657 20.6389 1.3471 8.3740 4.9848 1.2952 16.1871 7.7558 39.6351 1.6859 3.0634 21.4400 19.2646 29.3050 6.6781 4.9758 9.3945 1.9743 5.2351 44.1714 9.8496 0.0979 5.3235 2.5332 1.3139 2.5597 34.0740 22.9261 28.7171 32.1044 9.1685 14.5077 14.1039 7.3335 3.0242 2.9767 31.0444 0.6099 50.1027 3.1799 12.6094 13.5804 2.4798 33.3708 13.7288 9.2705 2.7326 7.9039 272.7052 45.0253 5.2661 41.0969 93.5114 23.5520 24.1174 18.0976 20.8730 13.5942 19.5070 37.9556 10.8669 0.5609 13.8185 27.1498 26.1718 6.4358
temp: 298.150 k
press: 1.00000 atm
elementType: 8 8 7 6 6 6 6 6 6 6 6 6 6 6 6 6 1 1 1 1 1 1 1 1 1 1 1 1 1 1 1 1 1
symmnumber: 1
zpe: 724274.7 jmol-1
zpe.correction: 0.275862 hartree
zpe.thermalcorrener: 0.291132 hartree
zpe.thermalcorrenthalpy: 0.292076 hartree
zpe.thermalcorrgfe: 0.230989 hartree
zpe.sumelectzpe: -709.584281 hartree
zpe.sumelectthermal: -709.569011 hartree
zpe.sumelectthermalent: -709.568067 hartree
zpe.sumelectthermalfe: -709.629154 hartree
dipole: 0.9391 -2.6747 -1.3998
dipole: 3.1616
quadrupole: -106.0047 -89.6234 -99.5431
quadrupole: -0.8153 -6.6843 -6.2989
quadrupole: -7.6143 8.7670 -1.1527 -0.8153 -6.6843 -6.2989
hfenergy: -709.8601427 hartree
pointgroup: C01 [X(C13H17N1O2)]
dipole: -0.1725948 0.4601023 -1.1426654 debye
polarizability: 146.2802113|16.2717043|136.3212914|9.9858227|-10.7845704|143.3924125 unknown
InChI: InChI=1S/C13H17NO2/c15-10-12-8-13(16)14(9-12)7-6-11-4-2-1-3-5-11/h1-5,12,15H,6-10H2
charge 0 multiplicity 1
33 atoms
O  5.184881 -0.813343 0.263097
O  0.594923 -0.026997 2.587153
N  0.993364 0.90102 0.454104
C  2.771421 -0.485896 -0.346114
C  1.728927 0.590548 -0.785188
C  2.128556 -1.114937 0.921645
C  1.161617 -0.047493 1.455294
C  0.073446 2.035404 0.579249
C  4.141244 0.168754 -0.053092
C  -1.053024 2.055953 -0.484586
C  -1.927411 0.806615 -0.564635
C  -2.530147 0.462851 -1.803269
C  -2.198305 -0.006733 0.5666
C  -3.390782 -0.652006 -1.912895
C  -3.057663 -1.124287 0.458911
C  -3.659759 -1.451281 -0.777673
H  2.919895 -1.237155 -1.140646
H  2.21488 1.501439 -1.188764
H  1.043143 0.197357 -1.562188
H  2.85013 -1.392753 1.711073
H  1.547668 -2.025845 0.68611
H  0.640876 2.985872 0.505347
H  -0.342153 1.978819 1.601399
H  4.038218 0.924099 0.757286
H  4.517312 0.675443 -0.958138
H  -1.688065 2.936444 -0.252793
H  -0.616937 2.258132 -1.482683
H  4.967424 -1.262283 1.118456
H  -2.327113 1.078402 -2.689592
H  -1.733007 0.214652 1.533969
H  -3.847345 -0.8968 -2.878866
H  -3.25207 -1.741146 1.343633
H  -4.325646 -2.317948 -0.857105
