program: Gaussian 09
title: 000295627
version: EM64L-G09RevD.01
frameworkgroup: C1[X(C12H11NO3)]
method: RPBEPBE
basis: SDD
operation: Freq
keyword: #p
keyword: freq=noraman
keyword: PBEPBE/SDD
title: #p freq=noraman PBEPBE/SDD
converged: YES YES NO NO
title: Mulliken charges:
elementType: O O O N C C C C C C C C C C C C H H H H H H H H H H H
charge: -0.255425 -0.251498 -0.220063 -0.111130 0.483285 -0.342897 0.031445 -0.383898 -0.381594 0.322886 -0.370257 -0.372628 0.234356 0.149545 -0.751565 -0.537161 0.245911 0.235413 0.307421 0.257345 0.248130 0.255080 0.248766 0.248753 0.250568 0.229615 0.229598
chargesum: 0.00000
title: Mulliken charges with hydrogens summed into heavy atoms:
elementType: O O O N C C C C C C C C C C C C
charge: -0.255425 -0.251498 -0.220063 -0.111130 0.483285 -0.096986 0.031445 -0.148485 -0.074173 0.322886 -0.112912 -0.124498 0.234356 0.149545 0.001034 0.172620
polarizability: 3.42509548e+02 6.53930019e+00 1.41912569e+02 -3.39687695e-02 -1.58413391e-02 6.77032882e+01
1716.lowfreq: -4.3871 -0.0005 0.0001 0.0005 2.9259 8.3981 39.0943 62.8746 94.5080
frequency: 38.9927 62.8332 94.5063 95.1305 119.4434 148.2762 173.7928 185.4302 220.4948 247.1180 266.2932 271.1423 308.5096 390.6250 399.2995 435.0476 460.5206 495.1691 534.4920 548.5715 600.4242 614.7990 626.3779 711.5479 724.3251 742.1989 750.1872 772.6526 806.6058 826.1236 846.8187 849.1445 949.1923 952.9454 979.5869 979.7420 1000.1482 1005.8934 1021.8386 1046.3300 1105.9398 1111.0094 1136.8866 1158.4171 1194.5478 1221.4577 1247.3545 1260.8119 1326.1232 1351.2669 1393.7840 1398.4937 1436.1367 1443.2010 1451.0898 1454.8547 1468.7554 1471.7478 1501.9356 1553.9391 1566.8415 1614.4881 1646.0389 1679.4949 2972.5738 2996.4519 3066.0390 3075.6132 3103.6276 3131.0810 3131.4810 3134.7150 3147.1790 3165.8437 3172.2746
redmass: 4.6091 4.3706 4.8649 3.2110 1.2153 3.4133 6.0488 4.6542 1.3006 5.9323 3.0573 3.9608 4.1813 5.5473 3.4173 3.2876 4.3223 6.6533 2.4353 5.4354 6.3980 5.4982 7.1682 7.4680 6.4317 5.6082 5.1774 7.2964 10.2922 1.2798 1.5288 5.8574 1.3655 3.0716 1.4571 8.4325 2.7434 1.3311 2.8360 1.5066 2.5011 1.2593 1.8385 1.3289 1.4416 3.8997 2.0938 2.8000 1.4512 2.4866 2.3607 1.2744 1.1817 3.5018 1.0442 1.0912 1.0497 1.0909 2.4041 6.8483 6.5453 6.3703 8.6350 10.7369 1.0322 1.0378 1.1044 1.0971 1.0871 1.0989 1.0895 1.1005 1.0911 1.0950 1.0958
irintensity: 2.8259 1.7267 2.9330 0.2110 3.3523 6.2708 0.0104 2.5295 0.0171 1.5388 0.0165 6.3681 0.1215 3.9208 0.8416 0.0041 0.3286 4.2231 22.2453 59.1850 5.2855 7.6462 3.5403 6.0995 15.0198 0.5780 9.8946 12.7707 247.2911 5.6432 63.6362 2.5560 16.2656 32.5914 8.7111 60.7905 1.4721 3.7351 70.4817 5.8276 30.1387 0.1412 11.5874 8.1928 264.7792 88.5686 47.1340 232.6496 1.0689 2.9024 73.7556 21.2629 10.9867 4.9972 18.1103 22.5443 15.1369 79.9342 100.0838 2.3326 40.9914 488.0733 244.1443 165.3056 71.6015 13.4478 39.2120 8.8582 4.8980 5.2461 10.2625 22.3616 8.2912 16.2788 12.1991
temp: 298.150 k
press: 1.00000 atm
elementType: 8 8 8 7 6 6 6 6 6 6 6 6 6 6 6 6 1 1 1 1 1 1 1 1 1 1 1
symmnumber: 1
zpe: 535891.5 jmol-1
zpe.correction: 0.204110 hartree
zpe.thermalcorrener: 0.218530 hartree
zpe.thermalcorrenthalpy: 0.219475 hartree
zpe.thermalcorrgfe: 0.162245 hartree
zpe.sumelectzpe: -743.136167 hartree
zpe.sumelectthermal: -743.121747 hartree
zpe.sumelectthermalent: -743.120803 hartree
zpe.sumelectthermalfe: -743.178033 hartree
dipole: 2.6015 0.8083 0.0076
dipole: 2.7242
quadrupole: -66.4312 -94.3530 -94.8940
quadrupole: -12.7320 0.0080 -0.0316
quadrupole: 18.7949 -9.1270 -9.6679 -12.7320 0.0080 -0.0316
hfenergy: -743.3402775 hartree
pointgroup: C01 [X(C12H11N1O3)]
dipole: 1.0068105 0.2884133 0.2276708 debye
polarizability: 341.3916665|11.9545863|115.9089033|11.1208554|36.1466888|94.8248352 unknown
InChI: InChI=1S/C12H11NO3/c1-8-13-11(12(14)16-8)7-9-3-5-10(15-2)6-4-9/h3-7H,1-2H3
charge 0 multiplicity 1
27 atoms
O  -3.591895 -1.12862 -1.013277
O  4.827522 0.220102 0.064969
O  -1.378629 -1.780203 -1.48108
N  -3.247665 0.69971 0.363205
C  0.604505 0.57438 0.300714
C  -0.815873 0.816367 0.471704
C  -1.956993 0.190451 -0.007176
C  1.502269 1.470405 0.974717
C  1.179507 -0.477924 -0.479812
C  3.435786 0.276558 0.097884
C  2.889575 1.33085 0.879781
C  2.573243 -0.626162 -0.580758
C  -4.140342 -0.06945 -0.22192
C  -2.141366 -0.988463 -0.893928
C  -5.624719 0.017654 -0.168542
C  5.458232 -0.846993 -0.724443
H  -1.0611 1.675432 1.11358
H  1.086412 2.285401 1.5794
H  0.524274 -1.177704 -1.006674
H  3.573533 2.01303 1.392705
H  2.978183 -1.44221 -1.186489
H  -5.916995 0.870361 0.462131
H  -6.057229 -0.910265 0.247252
H  -6.04635 0.149345 -1.181303
H  6.539192 -0.691261 -0.599665
H  5.187446 -0.763953 -1.793851
H  5.175679 -1.84554 -0.341224
