program: Gaussian 09
title: 000295606
version: EM64L-G09RevD.01
frameworkgroup: C1[X(C8H17NO2)]
method: RPBEPBE
basis: SDD
operation: Freq
keyword: #p
keyword: freq=noraman
keyword: PBEPBE/SDD
title: #p freq=noraman PBEPBE/SDD
converged: YES YES NO NO
title: Mulliken charges:
elementType: O O N C C C C C C C C H H H H H H H H H H H H H H H H H
charge: -0.416188 -0.240879 -0.577052 -0.415362 -0.101465 -0.354391 -0.352946 -0.481622 -0.357440 -0.696626 0.178670 0.186954 0.215666 0.238981 0.185624 0.226922 0.184753 0.184978 0.226858 0.231215 0.196566 0.196284 0.260139 0.274739 0.215076 0.208758 0.209465 0.372323
chargesum: 0.00000
title: Mulliken charges with hydrogens summed into heavy atoms:
elementType: O O N C C C C C C C C
charge: -0.043865 -0.240879 -0.042173 -0.012742 0.137516 0.058154 0.016784 -0.023549 0.035410 -0.063326 0.178670
polarizability: 1.13950100e+02 -4.80296455e+00 1.03733417e+02 1.57367709e+00 6.48140168e-01 8.98199651e+01
1716.lowfreq: -2.8580 -0.0010 -0.0009 -0.0005 7.7867 14.8413 30.4145 37.5024 56.9229
frequency: 30.3781 37.4126 56.7070 75.6544 93.0466 111.8890 124.9565 163.2646 229.3455 242.4715 263.4279 277.3694 348.0167 386.9890 406.4503 458.2310 470.6055 532.2299 571.0924 618.6790 686.1994 725.4740 752.4081 825.3441 852.4237 867.9085 896.8378 935.9062 954.5256 986.9209 1023.2505 1042.3547 1046.1531 1064.8822 1078.6437 1110.7653 1136.2879 1170.3234 1190.0516 1226.7638 1245.3138 1252.7901 1274.5949 1286.4839 1291.1348 1301.9773 1313.1224 1333.0892 1350.0914 1355.2997 1375.4308 1388.1692 1441.5814 1458.5687 1464.0429 1470.1919 1478.9274 1481.2430 1488.2409 1634.4536 1654.7329 2947.9138 2950.5445 2964.8574 2970.2446 2970.9933 2990.7305 3003.6999 3011.5368 3016.8209 3023.3519 3049.9148 3067.3911 3069.3415 3089.0877 3459.5541 3497.7962 3590.5447
redmass: 9.3947 3.3599 1.8775 3.3449 3.2521 2.7024 1.9966 2.9432 2.9422 1.1209 1.1466 3.0812 2.9078 2.6714 2.7662 2.2973 2.5825 1.8166 2.4666 1.6356 2.3564 1.0698 1.1568 1.3837 2.0588 5.4866 1.7335 1.4936 1.9360 2.9197 2.7023 1.2836 1.8629 2.3957 2.3886 2.3721 2.1481 1.5268 1.6595 1.3817 1.3545 1.3108 1.3228 1.0677 1.3317 1.1467 1.4966 1.5085 1.4787 1.6354 1.4460 1.2176 1.1183 1.0831 1.0667 1.0734 1.0425 1.0729 1.0891 1.1115 7.5402 1.0608 1.0626 1.0606 1.0410 1.0574 1.0967 1.0854 1.0626 1.0926 1.1007 1.1019 1.1008 1.0992 1.1031 1.0444 1.0637 1.0984
irintensity: 2.5964 0.0706 0.1074 0.1119 0.9760 0.1070 0.0257 0.1178 0.9611 0.0135 37.8186 8.4080 38.3252 1.3273 2.3971 6.3314 35.7646 49.5352 227.7967 128.1278 61.2894 10.4814 0.1504 1.1697 8.9143 12.8905 1.6491 7.1096 6.3162 67.9268 8.4262 14.8985 177.4441 11.9689 2.6508 24.3351 53.6302 12.6726 1.3068 5.2890 2.9776 8.2547 2.4497 0.9117 8.5493 0.8202 11.0398 48.2075 7.0165 3.2411 8.9968 11.9071 10.7004 3.8620 0.0358 0.6148 12.2268 3.1710 20.5776 68.3314 211.6221 1.6433 22.9622 5.2314 79.6724 58.8228 6.2351 12.7468 9.0276 32.7145 1.0435 64.3570 102.2020 55.4578 17.5997 2.8617 17.3929 1.2750
temp: 298.150 k
press: 1.00000 atm
elementType: 8 8 7 6 6 6 6 6 6 6 6 1 1 1 1 1 1 1 1 1 1 1 1 1 1 1 1 1
symmnumber: 1
zpe: 640513.2 jmol-1
zpe.correction: 0.243959 hartree
zpe.thermalcorrener: 0.257970 hartree
zpe.thermalcorrenthalpy: 0.258914 hartree
zpe.thermalcorrgfe: 0.201537 hartree
zpe.sumelectzpe: -519.340558 hartree
zpe.sumelectthermal: -519.326547 hartree
zpe.sumelectthermalent: -519.325602 hartree
zpe.sumelectthermalfe: -519.382979 hartree
dipole: 0.3232 0.8444 -1.8230
dipole: 2.0349
quadrupole: -71.0347 -61.3407 -73.3915
quadrupole: 3.4195 -4.4453 -0.6968
quadrupole: -2.4458 7.2483 -4.8025 3.4195 -4.4453 -0.6968
hfenergy: -519.5845163 hartree
pointgroup: C01 [X(C8H17N1O2)]
dipole: 0.1401041 0.312497 -0.7236355 debye
polarizability: 114.1280229|-4.3895091|103.4443463|2.5202374|0.102473|89.9311127 unknown
InChI: InChI=1S/C8H17NO2/c1-2-3-4-5-7(9)6-8(10)11/h7,10H,2-6,9H2,1H3
charge 0 multiplicity 1
28 atoms
O  3.06939 -1.626411 -0.708173
O  3.017146 -0.889291 1.493637
N  0.74586 2.540645 -0.184143
C  -0.053228 0.212178 -0.363753
C  1.052116 1.14977 0.179281
C  -1.427818 0.440021 0.300555
C  -2.553396 -0.40681 -0.334221
C  2.478884 0.692288 -0.320587
C  -3.927364 -0.19448 0.342038
C  -5.054045 -1.029568 -0.303914
C  2.883602 -0.635725 0.273999
H  -0.138144 0.362344 -1.462326
H  0.258398 -0.841362 -0.220094
H  1.062737 1.08471 1.284779
H  -1.35134 0.197832 1.381254
H  -1.678798 1.516047 0.236797
H  -2.637033 -0.157991 -1.413492
H  -2.285348 -1.483506 -0.284566
H  2.496123 0.636794 -1.422283
H  3.213657 1.449005 0.011426
H  -4.190459 0.882096 0.2982
H  -3.845887 -0.450077 1.418282
H  0.639006 2.704931 -1.190039
H  1.313896 3.256078 0.277512
H  -6.024361 -0.860487 0.198631
H  -5.177042 -0.769555 -1.372536
H  -4.827872 -2.111325 -0.247081
H  3.311517 -2.483551 -0.260685
