program: Gaussian 09
title: 000295620
version: EM64L-G09RevD.01
frameworkgroup: C1[X(C12H12O4)]
method: RPBEPBE
basis: SDD
operation: Freq
keyword: #pfreq=noraman
keyword: PBEPBE/SDD
title: #p freq=noraman PBEPBE/SDD
converged: YES YES NO NO
title: Mulliken charges:
elementType: O O O O C C C C C C C C C C C C H H H H H H H H H H H H
charge: -0.258502 -0.202491 -0.256288 -0.258479 -0.318251 -0.560970 0.320294 0.146493 -0.016684 -0.525840 0.244591 -0.350700 0.346187 -0.353129 -0.500779 -0.536451 0.281004 0.248088 0.289812 0.290938 0.275770 0.258799 0.244361 0.237357 0.245502 0.229411 0.248680 0.231277
chargesum: 0.00000
title: Mulliken charges with hydrogens summed into heavy atoms:
elementType: O O O O C C C C C C C C C C C C
charge: -0.258502 -0.202491 -0.256288 -0.258479 -0.037247 -0.023070 0.320294 0.146493 -0.016684 -0.234902 0.244591 -0.074929 0.346187 -0.094330 0.226441 0.172916
polarizability: 1.77693119e+02 2.10635685e+01 1.68413160e+02 -6.44984414e+00 8.94572598e+00 8.66050872e+01
1716.lowfreq: -7.7990 -4.1771 0.0005 0.0006 0.0008 1.3965 19.5326 42.1042 71.3638
frequency: 19.0187 42.0787 71.3459 78.7611 93.1226 137.4999 159.0010 163.8262 194.3983 216.9190 240.6895 266.3027 288.1976 305.0383 372.4484 430.4878 440.2838 474.3016 505.0496 527.5165 562.9258 588.5317 618.2267 650.9476 708.6755 714.2461 737.4989 792.2776 801.1398 844.2000 884.3281 891.5518 932.4559 977.5168 982.3064 987.8929 1026.9275 1048.6088 1079.0132 1111.4077 1113.5240 1141.5076 1144.4086 1154.8277 1157.5303 1184.5484 1214.8849 1227.3438 1254.9572 1270.3450 1275.7863 1289.5588 1395.1809 1422.1819 1430.1828 1437.6725 1445.6163 1452.7187 1462.0149 1467.7243 1470.8362 1479.8086 1590.6535 1605.9316 1621.9711 1635.3959 2970.8910 2995.3725 3008.6809 3030.3924 3063.1061 3090.0279 3112.6796 3133.8704 3150.7052 3154.5773 3163.8098 3174.0559
redmass: 4.2969 3.5859 2.9960 1.8397 2.4860 4.6084 3.0648 3.3891 3.3783 1.4475 3.4148 6.5180 3.5727 3.9061 9.1108 3.5004 4.7673 4.9214 5.2753 2.5321 5.8959 4.6600 3.8247 5.5921 5.7649 4.6154 5.0285 4.4357 4.4406 1.4884 1.8863 2.6260 3.0355 2.3413 3.8983 2.1646 5.0029 2.4146 2.5708 1.2611 1.2674 1.3866 1.4588 1.4007 1.4520 1.6963 3.0772 1.8351 1.4957 2.4063 2.1692 1.5221 6.9318 1.1951 1.6048 1.1477 2.0967 1.0509 1.0513 1.0492 1.2069 2.1953 8.3585 7.5068 10.0188 10.9166 1.0324 1.0823 1.0293 1.0609 1.1044 1.1014 1.1048 1.1005 1.0889 1.1051 1.0917 1.0970
irintensity: 2.3064 3.6558 0.1789 0.4291 1.4799 9.9953 2.2446 4.3120 5.4158 1.4422 0.7599 14.1161 1.6077 6.6355 8.2122 3.4092 9.6213 9.4982 5.5948 5.0331 3.1400 9.4049 0.9205 13.3481 10.0536 4.6820 0.7901 1.7879 6.9434 52.0646 22.4064 14.9736 7.4853 30.6606 40.3167 32.4269 48.2035 7.5538 66.6957 0.1681 0.6176 24.7177 46.0823 6.6266 8.2961 103.2869 203.1454 71.0001 47.2547 149.5595 106.1015 5.8162 4.8607 21.8762 0.8628 2.5672 34.3352 15.1385 12.3512 15.0034 70.1934 21.9893 64.0476 273.6750 377.5900 82.3299 52.3258 4.3376 30.4130 9.1485 38.5874 6.2875 23.1512 23.0026 1.0419 12.4444 1.8564 7.7276
temp: 298.150 k
press: 1.00000 atm
elementType: 8 8 8 8 6 6 6 6 6 6 6 6 6 6 6 6 1 1 1 1 1 1 1 1 1 1 1 1
symmnumber: 1
zpe: 564411.6 jmol-1
zpe.correction: 0.214973 hartree
zpe.thermalcorrener: 0.230106 hartree
zpe.thermalcorrenthalpy: 0.231051 hartree
zpe.thermalcorrgfe: 0.171012 hartree
zpe.sumelectzpe: -764.200813 hartree
zpe.sumelectthermal: -764.185679 hartree
zpe.sumelectthermalent: -764.184735 hartree
zpe.sumelectthermalfe: -764.244774 hartree
dipole: 0.0385 -4.8043 -0.0370
dipole: 4.8046
quadrupole: -80.5110 -103.6946 -90.0265
quadrupole: -3.7947 2.4721 -4.2351
quadrupole: 10.8997 -12.2839 1.3842 -3.7947 2.4721 -4.2351
hfenergy: -764.4157856 hartree
pointgroup: C01 [X(C12H12O4)]
dipole: 0.1657456 1.8827984 0.0274989 debye
polarizability: 173.5448495|-21.8929494|171.7853207|10.6136973|7.7939274|87.3811952 unknown
InChI: InChI=1S/C12H12O4/c1-15-7-3-4-8-9(5-7)10(6-11(8)13)12(14)16-2/h3-5,10H,6H2,1-2H3
charge 0 multiplicity 1
28 atoms
O  3.086661 0.835613 -0.3148
O  0.860327 -3.603933 -0.028472
O  -3.393562 1.425679 -0.299257
O  1.709558 2.3145 0.832316
C  1.303065 -0.099108 1.063154
C  1.926211 -1.489579 0.762074
C  -0.120881 -0.18281 0.47895
C  -0.400335 -1.494094 0.030708
C  0.778572 -2.369773 0.217659
C  -1.079534 0.842496 0.398549
C  2.033056 1.137843 0.54026
C  -1.672474 -1.81568 -0.507763
C  -2.347668 0.514014 -0.150507
C  -2.644087 -0.809352 -0.597315
C  3.80883 2.001769 -0.885342
C  -3.164075 2.810949 0.132114
H  1.215135 0.063549 2.155701
H  2.379507 -1.960479 1.650996
H  2.715208 -1.416155 -0.006036
H  -0.834214 1.850958 0.7432
H  -1.877305 -2.836251 -0.846914
H  -3.639985 -1.002214 -1.006887
H  3.123263 2.603797 -1.50449
H  4.611896 1.562346 -1.49259
H  4.215038 2.629861 -0.075414
H  -2.947609 2.859968 1.21606
H  -4.104646 3.336639 -0.085669
H  -2.333754 3.272447 -0.434983
