program: Gaussian 09
title: 000295625
version: EM64L-G09RevD.01
frameworkgroup: C1[X(C14H16O4)]
method: RPBEPBE
basis: SDD
operation: Freq
keyword: #pfreq=noraman
keyword: PBEPBE/SDD
title: #p freq=noraman PBEPBE/SDD
converged: NO YES NO NO
title: Mulliken charges:
elementType: O O O O C C C C C C C C C C C C C C H H H H H H H H H H H H H H H H
charge: -0.471126 -0.267506 -0.191522 -0.243837 -0.257908 0.175329 -0.434779 -0.575641 -0.521954 0.207133 0.480338 0.177993 -0.456382 -0.387335 -0.227112 -0.242330 -0.243705 -0.497857 0.226452 0.225442 0.246253 0.261124 0.250957 0.219381 0.254562 0.377633 0.231402 0.265515 0.225192 0.225624 0.228754 0.249949 0.253474 0.236486
chargesum: 0.00000
title: Mulliken charges with hydrogens summed into heavy atoms:
elementType: O O O O C C C C C C C C C C C C C C
charge: -0.093493 -0.267506 -0.191522 -0.243837 -0.031456 0.175329 0.036916 -0.063559 -0.048010 0.207133 0.480338 0.177993 -0.224980 -0.121820 -0.001920 -0.016705 -0.014951 0.242051
polarizability: 1.94409418e+02 -6.18540378e+00 1.37393875e+02 -5.93680725e-01 -1.49505074e+01 1.33359822e+02
1716.lowfreq: -3.9322 -0.0008 -0.0004 -0.0003 8.6742 10.6933 40.0157 46.3126 58.4514
frequency: 39.9377 46.2565 58.4162 68.1719 88.6970 95.5277 104.8804 142.2409 164.5634 199.6879 228.7960 244.9116 256.6539 288.3887 324.6582 349.9922 358.2766 389.6519 409.8293 413.9635 450.0870 482.2701 510.8516 547.3051 574.7674 616.0724 647.7065 681.2563 707.9423 719.8388 732.8547 765.0522 787.1755 811.5877 844.1853 856.1523 895.8439 915.8268 921.8213 950.3812 975.2499 979.0135 991.0687 996.8474 1001.2531 1029.4764 1058.3772 1068.1000 1075.5074 1094.6529 1114.8140 1149.3161 1153.7879 1172.5313 1180.7989 1190.2669 1191.8318 1209.1484 1222.5081 1260.3390 1269.3888 1280.9062 1296.0088 1317.0223 1334.0115 1354.1035 1362.8749 1385.2414 1423.3626 1426.1998 1436.9854 1444.2338 1453.5477 1462.3919 1464.3366 1483.0023 1590.2878 1612.0539 1615.1534 1640.9772 2958.5718 2990.4959 2997.3225 3011.0632 3013.9936 3070.4149 3080.7475 3086.5392 3113.0656 3117.8361 3126.4093 3138.8965 3155.6184 3157.4465 3167.9911 3450.6010
redmass: 4.3234 4.6952 6.4299 4.2085 2.9354 1.4733 2.7614 3.3821 4.1056 5.0734 4.4757 3.4938 4.1642 4.4995 3.9472 2.8224 3.7879 1.7148 2.5379 1.9883 5.2665 3.4715 3.3344 3.5152 5.4763 6.3870 5.9632 3.6158 1.7500 3.7394 4.2659 2.1358 2.6075 2.6933 2.9362 1.2449 5.1887 2.3779 1.6422 2.0610 2.0282 1.4647 6.1634 1.3735 3.3175 2.1709 2.1156 2.6136 2.3265 2.2256 1.2654 1.7088 1.4648 1.0701 2.3020 2.5046 1.1915 1.5535 2.3808 1.7676 1.3118 1.3757 1.6402 1.3125 1.3653 1.5226 1.6250 4.5974 1.2020 1.0915 1.1600 1.8591 1.0497 1.0512 1.0828 2.2779 5.9239 6.6137 8.2934 9.7167 1.0666 1.0803 1.0645 1.0291 1.0610 1.0948 1.1012 1.0991 1.0871 1.1052 1.0868 1.0929 1.0962 1.1056 1.0987 1.0650
irintensity: 0.6655 1.7755 2.0452 0.4821 0.7046 0.5548 4.4430 1.4561 2.4478 4.1457 0.5187 7.8752 2.4295 8.9868 15.5051 55.2645 35.3047 45.6984 5.1018 12.3167 2.3759 3.6195 15.5405 8.5787 7.4720 0.3552 7.0296 8.4730 51.7935 2.4798 2.7766 45.5186 11.8547 0.4323 8.0032 1.0661 14.2630 11.2811 6.7212 21.2443 25.7152 2.3097 0.2490 0.7365 5.6390 5.1093 3.0103 32.8554 26.7338 53.6678 0.0365 3.6484 8.6563 1.2691 113.0798 205.4141 9.4513 8.6743 30.0642 14.8121 12.1200 3.7050 2.1780 3.3041 2.5332 28.5035 5.9381 0.3354 18.3128 18.4508 22.1177 2.7165 14.8261 8.8647 9.5231 19.8137 1.7225 30.5627 113.5992 201.6104 13.8015 7.3250 12.5656 26.6092 26.2882 18.9378 12.9177 7.5303 9.5649 17.9870 0.4280 28.9348 31.6338 11.3052 9.9103 54.1682
temp: 298.150 k
press: 1.00000 atm
elementType: 8 8 8 8 6 6 6 6 6 6 6 6 6 6 6 6 6 6 1 1 1 1 1 1 1 1 1 1 1 1 1 1 1 1
symmnumber: 1
zpe: 712355.1 jmol-1
zpe.correction: 0.271322 hartree
zpe.thermalcorrener: 0.288512 hartree
zpe.thermalcorrenthalpy: 0.289456 hartree
zpe.thermalcorrgfe: 0.225786 hartree
zpe.sumelectzpe: -842.647409 hartree
zpe.sumelectthermal: -842.630218 hartree
zpe.sumelectthermalent: -842.629274 hartree
zpe.sumelectthermalfe: -842.692945 hartree
dipole: -3.8900 2.2008 -3.2696
dipole: 5.5377
quadrupole: -120.9576 -95.0700 -103.7089
quadrupole: 2.5362 -4.7055 -5.9158
quadrupole: -14.3788 11.5088 2.8699 2.5362 -4.7055 -5.9158
hfenergy: -842.9187304 hartree
pointgroup: C01 [X(C14H16O4)]
dipole: 1.3953641 -1.1229964 -1.2403937 debye
polarizability: 192.0733742|-12.6805902|141.5058116|2.4436357|14.443958|131.5839292 unknown
InChI: InChI=1S/C14H16O4/c1-18-13(16)14(17)9-11(15)7-8-12(14)10-5-3-2-4-6-10/h2-6,12,17H,7-9H2,1H3
charge 0 multiplicity 1
34 atoms
O  -0.973756 0.446583 1.704089
O  -0.464208 -2.3764 -0.580701
O  -4.31623 1.321603 0.162393
O  0.034701 -2.05199 1.670665
C  -0.24462 0.587683 -0.668066
C  -1.045246 -0.233311 0.410839
C  -0.856974 2.008861 -0.748461
C  -2.544166 -0.342871 0.012411
C  -2.354769 1.969826 -1.146106
C  -3.172647 1.025934 -0.268296
C  1.259519 0.600046 -0.405621
C  -0.436045 -1.635651 0.583434
C  2.131208 -0.115825 -1.266761
C  1.822445 1.313676 0.686145
C  3.527745 -0.121133 -1.05026
C  3.217599 1.306565 0.90655
C  4.076633 0.590663 0.040701
C  0.152425 -3.728193 -0.504417
H  -0.41744 0.072418 -1.634484
H  -0.290726 2.608718 -1.48397
H  -0.754454 2.502345 0.234046
H  -3.116554 -0.836309 0.815581
H  -2.625536 -0.95561 -0.907159
H  -2.441773 1.600937 -2.191306
H  -2.813841 2.972388 -1.109693
H  -0.487838 -0.154525 2.335358
H  1.710298 -0.668105 -2.116748
H  1.166418 1.870618 1.362225
H  4.18439 -0.674626 -1.73132
H  3.635655 1.860804 1.75469
H  5.158968 0.590632 0.211879
H  -0.353647 -4.330391 0.267792
H  1.222346 -3.63368 -0.256464
H  0.008323 -4.15748 -1.505066
