program: Gaussian 09
title: 000295638
version: EM64L-G09RevD.01
frameworkgroup: C1[X(C20H20N2O)]
method: RPBEPBE
basis: SDD
operation: Freq
keyword: #p
keyword: freq=noraman
keyword: PBEPBE/SDD
title: #p freq=noraman PBEPBE/SDD
converged: YES YES NO NO
title: Mulliken charges:
elementType: O N N C C C C C C C C C C C C C C C C C C C C H H H H H H H H H H H H H H H H H H H H
charge: -0.270207 -0.123994 -0.488206 -0.124619 0.190425 -0.576355 -0.377877 0.109569 -0.511666 -0.494610 0.335771 0.277000 0.171161 0.192888 -0.560035 -0.391071 -0.433936 -0.377965 0.330375 -0.387770 -0.256547 -0.225329 -0.536912 0.215079 0.186908 0.257442 0.194628 0.213760 0.205228 0.227575 0.235051 0.191213 0.298477 0.256241 0.228536 0.231631 0.228498 0.240691 0.217548 0.218754 0.220096 0.218921 0.243632
chargesum: 0.00000
title: Mulliken charges with hydrogens summed into heavy atoms:
elementType: O N N C C C C C C C C C C C C C C C C C C C C
charge: -0.270207 -0.123994 -0.189729 0.090460 0.190425 -0.132005 0.030511 0.109569 -0.078863 -0.068346 0.335771 0.277000 0.171161 0.192888 -0.303793 -0.162535 -0.202305 -0.149467 0.330375 -0.147079 -0.038998 -0.006576 0.145737
polarizability: 3.58522576e+02 -5.44501724e+00 2.30367202e+02 -1.30892352e+01 -5.49098576e+00 1.22381377e+02
1716.lowfreq: -10.5687 -0.5949 -0.0010 -0.0007 0.0009 5.6169 31.3891 45.3130 66.2976
frequency: 31.3313 45.1581 66.2864 82.7889 113.1985 120.4009 160.3593 172.4989 194.9134 214.0707 226.0672 238.1930 255.1674 287.7040 297.3294 311.0615 330.9101 347.5998 409.5718 427.5374 434.0720 459.4190 481.5384 489.3224 501.6804 522.5634 541.6665 560.9817 577.5309 578.8570 594.3808 617.0881 666.1772 702.3107 709.0691 720.1826 740.2243 747.9881 758.2962 764.2292 784.2157 800.6915 849.2878 863.8230 877.6156 886.9461 911.3366 926.6321 927.9884 946.8770 967.8941 971.8817 981.8341 1007.5200 1008.5766 1013.7925 1041.2054 1070.3115 1105.7106 1112.5330 1115.1150 1123.8952 1141.0137 1144.5279 1157.6295 1170.9495 1176.8411 1193.5833 1205.1974 1210.8832 1218.4589 1230.3215 1237.4561 1246.8834 1250.6628 1271.9297 1286.8673 1294.7807 1312.9101 1320.6169 1327.3780 1343.9551 1364.2647 1380.7851 1396.7570 1410.0009 1429.2639 1436.2697 1439.8127 1443.7061 1458.3489 1461.1866 1466.5771 1473.8198 1474.6817 1478.9854 1481.2762 1500.8355 1581.2618 1587.1260 1603.0357 1629.5555 1634.1314 2783.5028 2795.8116 2851.6131 2956.3072 2974.1424 2975.6336 2999.7062 3022.7803 3029.3856 3033.9248 3042.7137 3114.4225 3120.8028 3122.5995 3128.2904 3142.3491 3142.8379 3160.5979 3162.7873 3609.3085
redmass: 4.1750 4.2067 4.2845 3.7134 3.8157 3.7126 2.9397 3.9047 4.1745 2.3919 2.9285 1.2822 3.1311 3.9001 3.8596 4.6827 3.0829 3.0986 4.7378 2.9205 2.6766 4.5358 1.3605 2.2513 4.3557 4.0064 5.1473 4.1122 3.9819 3.8164 4.0836 5.6783 4.8529 3.8417 3.3662 3.5825 3.5323 1.3548 3.8898 4.2336 3.6443 1.4182 1.4604 3.2544 1.8246 2.1397 3.1940 1.5492 1.3883 3.4417 1.2978 2.5432 1.9861 3.7205 2.3158 2.0452 2.2985 2.5896 2.4703 1.2686 2.2500 2.0532 2.9127 1.4842 1.4516 1.3331 1.4987 1.2230 1.4653 1.5151 1.3480 1.5255 2.1324 1.4256 2.0682 2.1070 2.0344 1.4187 1.4007 1.4656 1.6217 1.7570 2.1756 2.5589 2.3137 3.6575 2.4519 1.2654 1.4221 2.4058 1.1057 1.1104 1.0502 2.1228 1.0782 1.7224 2.9106 2.5971 6.6237 7.2248 7.6567 7.0131 7.0151 1.0784 1.0712 1.0707 1.0331 1.0601 1.0599 1.0853 1.0969 1.0922 1.1004 1.1038 1.0893 1.0847 1.0991 1.0890 1.0951 1.0916 1.1001 1.0937 1.0801
irintensity: 0.3557 0.4885 0.9395 4.4007 2.4336 0.0394 4.0133 0.4924 1.9165 1.4710 0.3364 0.6637 3.4086 1.7527 5.1491 0.8210 5.4532 0.7047 0.9292 9.6230 7.2755 0.3107 72.8345 8.6202 1.6348 8.4627 0.3283 9.0499 0.4782 8.6878 0.0379 2.6534 7.0650 1.4979 8.3121 13.3052 11.2564 87.4269 4.1381 4.4258 7.2189 39.3149 0.1077 2.8618 13.7919 2.5988 1.9107 0.0592 3.0218 2.4304 0.0183 7.8767 9.7836 79.2606 1.9362 5.6443 2.3986 6.7267 17.0596 0.5768 9.1812 16.1024 69.2045 8.7444 28.2397 22.4078 25.5928 3.3358 26.1971 2.1829 1.5193 10.7219 3.8770 4.3532 78.2553 60.0956 5.0660 37.5140 8.3803 12.9693 10.4581 79.6453 15.6809 35.5615 10.6027 12.3475 17.7354 5.5573 0.9684 10.9155 17.4058 5.1025 13.0603 27.4566 47.7235 23.3023 1.4825 101.5331 0.7619 16.9955 6.1125 91.3377 2.1780 42.4931 110.4675 124.7489 80.8790 41.3917 31.4472 20.9554 36.3336 53.8087 21.0649 51.9902 20.1336 1.5911 23.5343 3.7213 36.7520 5.3089 40.4921 17.0558 38.4874
temp: 298.150 k
press: 1.00000 atm
elementType: 8 7 7 6 6 6 6 6 6 6 6 6 6 6 6 6 6 6 6 6 6 6 6 1 1 1 1 1 1 1 1 1 1 1 1 1 1 1 1 1 1 1 1
symmnumber: 1
zpe: 926145.6 jmol-1
zpe.correction: 0.352750 hartree
zpe.thermalcorrener: 0.371407 hartree
zpe.thermalcorrenthalpy: 0.372351 hartree
zpe.thermalcorrgfe: 0.306210 hartree
zpe.sumelectzpe: -957.220089 hartree
zpe.sumelectthermal: -957.201432 hartree
zpe.sumelectthermalent: -957.200488 hartree
zpe.sumelectthermalfe: -957.266629 hartree
dipole: -3.1854 0.5660 1.3980
dipole: 3.5244
quadrupole: -118.1330 -122.0374 -140.6189
quadrupole: -3.3330 -1.4467 -2.8520
quadrupole: 8.7968 4.8924 -13.6891 -3.3330 -1.4467 -2.8520
hfenergy: -957.572839 hartree
pointgroup: C01 [X(C20H20N2O1)]
dipole: -1.256665 -0.2106083 -0.5469264 debye
polarizability: 358.6759934|4.018871|230.2103706|12.5890245|-6.0971946|122.3847916 unknown
InChI: InChI=1S/C20H20N2O/c1-23-15-7-6-13-12-22-9-8-17-16-4-2-3-5-18(16)21-20(17)19(22)11-14(13)10-15/h2-7,10,19,21H,8-9,11-12H2,1H3
charge 0 multiplicity 1
43 atoms
O  -5.651145 1.915983 0.301357
N  -0.241582 -1.654644 0.072521
N  2.098912 1.240172 -0.601809
C  0.052259 -0.320249 -0.526972
C  1.512643 -0.009624 -0.333018
C  -0.875028 0.720541 0.150481
C  0.800374 -2.682776 -0.184831
C  2.484722 -0.887343 0.134692
C  2.140497 -2.31059 0.48931
C  -1.586208 -2.12756 -0.321692
C  -2.334173 0.298389 0.068026
C  -2.66691 -1.070123 -0.132967
C  3.738657 -0.160704 0.172285
C  3.466674 1.176739 -0.298123
C  -3.362563 1.25495 0.204655
C  -4.029209 -1.438635 -0.187942
C  5.065125 -0.497652 0.548989
C  4.47202 2.161558 -0.396032
C  -4.722012 0.870544 0.150942
C  -5.065337 -0.489888 -0.046404
C  6.073503 0.482567 0.453676
C  5.780718 1.797789 -0.012973
C  -7.071247 1.565184 0.256182
H  -0.181358 -0.326807 -1.628222
H  -0.747333 1.717017 -0.31798
H  -0.56341 0.809369 1.208768
H  0.968555 -2.825756 -1.283662
H  0.427036 -3.642438 0.219191
H  2.927738 -3.01162 0.148432
H  2.046439 -2.433106 1.586409
H  -1.828025 -3.019159 0.288451
H  -1.59828 -2.46434 -1.395051
H  1.606327 2.062454 -0.942743
H  -3.12719 2.314044 0.357325
H  -4.294334 -2.492413 -0.342078
H  5.303091 -1.504295 0.911282
H  4.253563 3.173993 -0.754429
H  -6.108857 -0.814956 -0.090293
H  7.101161 0.234879 0.742605
H  6.585928 2.53844 -0.075375
H  -7.341008 0.864442 1.07056
H  -7.347384 1.120543 -0.720229
H  -7.606952 2.515977 0.393986
