program: Gaussian 09
title: 000295622
version: EM64L-G09RevD.01
frameworkgroup: C1[X(C14H16O4)]
method: RPBEPBE
basis: SDD
operation: Freq
keyword: #pfreq=noraman
keyword: PBEPBE/SDD
title: #p freq=noraman PBEPBE/SDD
converged: YES YES NO NO
title: Mulliken charges:
elementType: O O O O C C C C C C C C C C C C C C H H H H H H H H H H H H H H H H
charge: -0.192731 -0.401792 -0.239196 -0.264521 -0.280259 -0.181337 -0.445305 -0.565711 -0.517097 0.542388 0.195641 0.165688 -0.432576 -0.392716 -0.354794 -0.375494 0.313851 -0.538095 0.237615 0.270515 0.216921 0.235697 0.253823 0.253695 0.249709 0.223461 0.243044 0.221966 0.251215 0.238533 0.379875 0.246327 0.220726 0.220934
chargesum: 0.00000
title: Mulliken charges with hydrogens summed into heavy atoms:
elementType: O O O O C C C C C C C C C C C C C C
charge: -0.192731 -0.021917 -0.239196 -0.264521 -0.042644 0.089178 0.007313 -0.058193 -0.043927 0.542388 0.195641 0.165688 -0.189531 -0.170750 -0.103579 -0.136961 0.313851 0.149892
polarizability: 2.17178359e+02 -1.07609898e+01 1.28141700e+02 3.14234413e+00 1.09968977e+01 1.35752103e+02
1716.lowfreq: -4.4333 0.0007 0.0008 0.0009 10.6084 12.4348 23.8560 26.2291 41.8736
frequency: 23.6050 26.1959 41.7795 46.7991 87.1466 102.2898 118.6800 136.2076 178.5832 206.5702 222.2811 230.9554 249.2952 283.7920 315.6161 397.2783 403.1589 413.0029 432.7399 451.5748 480.6130 500.0891 537.3048 542.0858 598.6477 606.9809 632.3769 652.6165 715.9434 735.7571 746.3467 757.3372 809.3712 813.3506 820.4799 836.6023 878.1315 914.5678 932.6700 960.8176 965.5816 971.7701 988.5986 1003.5995 1038.3289 1051.5230 1075.4331 1076.7136 1110.1378 1112.2534 1122.5641 1155.8293 1179.6614 1187.3151 1193.9092 1214.8708 1229.3272 1233.4169 1256.2653 1276.1835 1282.3751 1287.2133 1304.8780 1320.1963 1322.6532 1350.5221 1360.4431 1390.5835 1421.5473 1435.9300 1437.1503 1446.3582 1466.4466 1471.3965 1473.1560 1502.0740 1583.7094 1623.6213 1638.1958 1653.3556 2958.8802 2971.1657 2981.3963 2982.5490 2995.3636 3039.9617 3046.4526 3055.9562 3074.5435 3077.7695 3121.1603 3125.3504 3129.7640 3158.1976 3167.0709 3498.9716
redmass: 4.0447 7.5180 7.4560 5.1346 3.8551 3.9046 3.9655 4.9206 3.3459 2.1809 3.7819 2.8476 1.8777 3.7036 5.2583 4.9106 2.6199 2.9246 2.7099 4.3286 3.4590 3.1922 3.4237 3.0532 3.3949 1.8179 5.7172 2.9118 4.3703 3.7555 2.5720 2.9989 1.8676 1.9025 3.2069 1.5558 1.9200 2.6405 1.4371 1.8201 1.8579 2.5002 8.4537 2.6151 2.2979 1.9056 2.5490 2.5101 1.4682 1.2598 1.6608 1.3494 1.2648 1.6638 1.4366 1.8610 1.6443 3.0796 1.7334 1.3923 1.4699 1.4530 1.3172 1.3060 1.4283 1.6680 1.8940 3.5558 2.7485 1.1760 1.0912 1.0912 1.0504 1.0884 1.0741 2.4460 6.9053 6.3658 9.3862 8.2731 1.0331 1.0650 1.0671 1.0768 1.0635 1.0853 1.1039 1.1005 1.0968 1.0983 1.0887 1.0989 1.0895 1.0940 1.0954 1.0638
irintensity: 0.6424 3.1691 1.0069 2.6483 6.0153 0.0116 2.8296 3.3667 0.9746 1.6088 0.8090 0.3613 0.5163 3.7252 2.3570 6.5893 3.0958 0.1383 0.1503 5.4836 10.7433 19.7214 14.5173 19.8378 22.0409 74.3900 7.7185 33.7671 47.1566 2.6377 4.6177 11.0808 23.8976 2.9406 3.7458 46.5378 4.6127 11.2107 0.3107 9.2056 11.2312 4.5819 39.6098 8.3789 24.8367 123.1250 8.4118 100.6779 5.9350 0.2253 12.4007 0.3513 77.4574 26.9004 8.1739 6.6693 43.8528 144.6278 28.2866 26.0980 10.6750 11.9986 1.4456 3.0160 4.8167 10.4296 27.1038 9.0928 0.5672 9.8407 18.7236 18.6884 13.6564 6.3354 59.1686 120.2060 8.0921 51.5013 198.9655 171.7944 66.4759 6.7168 6.7854 8.6454 33.2843 8.6300 48.5491 26.7835 19.4535 12.8708 26.6873 17.8864 11.0040 13.2254 4.6501 22.4369
temp: 298.150 k
press: 1.00000 atm
elementType: 8 8 8 8 6 6 6 6 6 6 6 6 6 6 6 6 6 6 1 1 1 1 1 1 1 1 1 1 1 1 1 1 1 1
symmnumber: 1
zpe: 714405.6 jmol-1
zpe.correction: 0.272103 hartree
zpe.thermalcorrener: 0.289197 hartree
zpe.thermalcorrenthalpy: 0.290141 hartree
zpe.thermalcorrgfe: 0.225073 hartree
zpe.sumelectzpe: -842.647271 hartree
zpe.sumelectthermal: -842.630177 hartree
zpe.sumelectthermalent: -842.629233 hartree
zpe.sumelectthermalfe: -842.694301 hartree
dipole: -3.5803 -0.6755 -0.8141
dipole: 3.7333
quadrupole: -115.9929 -103.1384 -104.1440
quadrupole: 4.9628 16.5850 -4.2973
quadrupole: -8.2345 4.6200 3.6144 4.9628 16.5850 -4.2973
hfenergy: -842.9193739 hartree
pointgroup: C01 [X(C14H16O4)]
dipole: 1.4021554 -0.2418364 0.3645367 debye
polarizability: 216.7740673|11.9526313|127.6192248|4.9031417|-10.3920582|136.678871 unknown
InChI: InChI=1S/C14H16O4/c1-18-11-5-2-9(3-6-11)12-7-4-10(15)8-13(12)14(16)17/h2-3,5-6,12-13,16H,4,7-8H2,1H3
charge 0 multiplicity 1
34 atoms
O  -4.816715 -1.122891 0.922293
O  -0.672622 2.630458 1.200911
O  -1.273878 2.599272 -1.04094
O  4.780638 -0.084326 -0.020225
C  -0.963579 -0.411185 -0.579395
C  -1.705682 0.607786 0.352188
C  -1.533268 -1.836467 -0.346653
C  -3.248221 0.567455 0.122061
C  -3.063626 -1.906073 -0.594158
C  0.553031 -0.351741 -0.394978
C  -3.806802 -0.85257 0.220849
C  -1.211128 2.017593 0.066063
C  1.383645 0.152426 -1.431015
C  1.174579 -0.773262 0.80563
C  2.780389 0.227865 -1.280629
C  2.575044 -0.704971 0.978265
C  3.382599 -0.202049 -0.07242
C  5.449233 -0.503977 1.213385
H  -1.195281 -0.111753 -1.621957
H  -1.481798 0.369202 1.407393
H  -1.316645 -2.161271 0.689804
H  -1.014704 -2.54763 -1.015456
H  -3.453758 0.95483 -0.897056
H  -3.777483 1.210455 0.846134
H  -3.470438 -2.902555 -0.351545
H  -3.262548 -1.709549 -1.668643
H  0.925895 0.499899 -2.364781
H  0.566439 -1.161293 1.632096
H  3.421137 0.617016 -2.077638
H  3.018192 -1.038467 1.921458
H  -0.351288 3.54317 0.961726
H  6.519462 -0.32337 1.035565
H  5.281761 -1.579608 1.417623
H  5.108915 0.095485 2.080349
