program: Gaussian 09
title: 000295628
version: EM64L-G09RevD.01
frameworkgroup: C1[X(C15H18O2S2)]
method: RPBEPBE
basis: SDD
operation: Freq
keyword: #p
keyword: freq=noraman
keyword: PBEPBE/SDD
title: #p freq=noraman PBEPBE/SDD
converged: YES YES NO NO
title: Mulliken charges:
elementType: S S O O C C C C C C C C C C C C C C C H H H H H H H H H H H H H H H H H H
charge: 0.258809 0.210724 -0.407312 -0.237301 -0.588463 -0.270899 -0.154059 -0.380419 -0.373170 -0.462392 0.519872 -0.614620 -0.617127 0.137677 -0.445570 -0.393981 -0.224553 -0.249654 -0.246210 0.237555 0.281390 0.251425 0.245417 0.249018 0.220748 0.228516 0.226191 0.261319 0.276350 0.267509 0.271267 0.240591 0.230381 0.375963 0.224901 0.222964 0.227142
chargesum: 0.00000
title: Mulliken charges with hydrogens summed into heavy atoms:
elementType: S S O O C C C C C C C C C C C C C C C
charge: 0.258809 0.210724 -0.031349 -0.237301 -0.588463 -0.033344 0.127331 0.116423 0.096596 -0.007685 0.519872 -0.076951 -0.078351 0.137677 -0.204979 -0.163600 0.000347 -0.026690 -0.019069
polarizability: 2.60456103e+02 1.80297937e+00 1.48983648e+02 5.16351639e+00 -1.73278312e+01 1.72776788e+02
1716.lowfreq: -9.9616 -3.2496 -0.0019 -0.0013 0.0019 13.2998 24.3914 32.9607 36.6014
frequency: 24.3236 32.6582 36.5506 45.6527 66.2119 81.1267 124.0283 145.3839 186.1892 189.7065 209.6782 235.6862 263.2651 271.8006 342.6942 344.7110 370.9681 375.0705 403.9649 410.6861 439.9034 466.6368 485.8218 531.6202 547.6999 602.4142 609.7218 617.4837 624.2990 629.4576 642.8429 704.8405 719.1796 739.0662 768.5061 792.3549 818.5572 851.9857 853.7075 876.6467 911.7343 916.9774 934.2888 954.7051 973.1334 975.2239 989.5134 992.3866 995.9876 1007.7170 1028.1080 1046.2426 1049.6826 1072.3272 1084.8924 1103.6092 1110.1608 1134.6715 1145.5406 1171.6418 1178.3884 1189.8526 1210.0997 1217.3236 1231.7355 1244.0796 1258.0701 1281.2802 1289.9904 1292.5101 1298.7149 1312.9168 1326.1167 1336.5727 1349.4895 1363.5290 1384.8432 1432.6976 1440.5898 1443.3105 1445.4963 1458.2075 1468.2897 1483.3336 1592.5021 1613.5486 1654.1614 2979.9150 2983.6097 2987.9002 2990.1036 3022.8477 3030.6908 3036.2246 3047.2626 3059.0683 3070.0666 3094.7683 3113.4341 3113.6582 3121.6706 3133.3138 3144.1947 3161.8083 3499.4657
redmass: 7.8672 4.3000 4.1916 4.5483 6.0183 6.5591 7.5405 4.9198 7.4671 3.4943 4.6723 2.2325 3.0653 4.7192 4.2768 3.3961 3.9086 3.5242 2.7989 6.1402 3.5178 2.7105 3.7400 3.0701 3.9549 3.0655 2.2507 5.6167 3.0565 4.0042 3.7291 1.6793 4.5381 3.7142 1.9649 2.4677 2.4206 1.2507 1.5848 3.3289 1.8104 1.5511 2.4287 1.5908 2.8002 1.4262 4.1171 2.0998 1.7412 2.3019 2.1939 2.9496 2.0681 1.7814 2.3160 1.1543 1.8757 1.6813 1.4014 1.0818 2.2531 1.1168 1.9131 1.4060 1.4592 1.4530 1.2808 1.3687 1.1979 1.3328 1.3855 1.3408 1.3148 1.3688 1.5739 1.6249 5.1944 1.0821 1.1029 2.0730 1.0833 1.0986 1.0982 2.2445 5.9648 6.1239 8.2492 1.0690 1.0628 1.0644 1.0755 1.0551 1.0592 1.0852 1.0995 1.0996 1.0983 1.1074 1.1083 1.0865 1.0862 1.0914 1.0960 1.1015 1.0638
irintensity: 1.8920 0.1890 1.5986 1.6978 0.2731 1.2801 0.9503 0.2973 0.6558 1.7578 0.4803 2.1916 1.2478 0.5004 0.3113 1.3232 5.2981 1.3947 0.0142 6.3675 0.9348 1.7220 6.9008 20.6252 15.1317 34.0475 51.4079 4.9328 20.4342 33.6332 0.5892 54.0417 29.0255 12.6820 39.8206 4.9082 3.3463 0.3052 8.9886 2.9984 6.5608 0.5014 4.5903 3.7112 18.7517 0.3857 12.1283 17.7273 14.4444 4.1151 5.4430 7.2225 181.9194 35.6681 3.9577 12.4631 37.0935 2.4493 1.2956 0.0657 1.0205 0.3795 1.7401 17.5211 4.0970 1.0881 4.7154 1.9285 9.4752 15.6069 12.6917 21.8077 2.1741 0.9160 16.1087 27.4541 0.5843 9.1792 4.0786 9.0892 19.5071 10.0879 7.2917 22.3311 1.7656 8.8319 173.7516 11.0637 1.0353 13.8785 21.6694 14.2997 45.0505 6.4988 30.2475 13.5347 17.4687 0.6397 19.2490 11.3349 0.7611 16.0589 38.2132 26.4133 19.8912
temp: 298.150 k
press: 1.00000 atm
elementType: 16 16 8 8 6 6 6 6 6 6 6 6 6 6 6 6 6 6 6 1 1 1 1 1 1 1 1 1 1 1 1 1 1 1 1 1 1
symmnumber: 1
zpe: 780379.7 jmol-1
zpe.correction: 0.297231 hartree
zpe.thermalcorrener: 0.315330 hartree
zpe.thermalcorrenthalpy: 0.316275 hartree
zpe.thermalcorrgfe: 0.249026 hartree
zpe.sumelectzpe: -1527.571838 hartree
zpe.sumelectthermal: -1527.553739 hartree
zpe.sumelectthermalent: -1527.552794 hartree
zpe.sumelectthermalfe: -1527.620043 hartree
dipole: 1.3562 -0.4074 1.7746
dipole: 2.2703
quadrupole: -113.1284 -129.1118 -125.8805
quadrupole: 0.9105 5.4092 4.4600
quadrupole: 9.5785 -6.4049 -3.1736 0.9105 5.4092 4.4600
hfenergy: -1527.869069 hartree
pointgroup: C01 [X(C15H18O2S2)]
dipole: -0.5408353 0.0298509 -0.7102443 debye
polarizability: 260.5692289|2.0375766|141.22053|3.451563|7.7506793|180.4267799 unknown
InChI: InChI=1S/C15H18O2S2/c16-14(17)13-10-15(18-8-9-19-15)7-6-12(13)11-4-2-1-3-5-11/h1-5,12-13,16H,6-10H2
charge 0 multiplicity 1
37 atoms
S  -4.169762 -0.351916 1.234795
S  -2.730521 -0.934786 -1.442728
O  0.499458 2.892943 -0.803289
O  0.885657 2.453285 1.441611
C  -2.432778 -0.523854 0.404104
C  0.567652 -0.427493 0.709537
C  -0.22224 0.741253 0.039209
C  -1.689351 0.818199 0.564971
C  -1.653793 -1.679289 1.061003
C  -0.205636 -1.762499 0.525079
C  2.000381 -0.520426 0.182603
C  -5.218044 -0.458647 -0.339934
C  -4.365727 0.000929 -1.524642
C  0.448858 2.071945 0.332064
C  3.100667 -0.284794 1.044684
C  2.262046 -0.838525 -1.176625
C  4.428674 -0.372541 0.568334
C  3.586808 -0.925772 -1.65703
C  4.676855 -0.695505 -0.78508
H  0.612513 -0.202245 1.794356
H  -0.254981 0.597618 -1.0556
H  -1.676026 1.083024 1.641656
H  -2.237787 1.619072 0.037517
H  -2.191646 -2.628646 0.895056
H  -1.631672 -1.499561 2.154913
H  0.339146 -2.569249 1.050339
H  -0.224419 -2.042655 -0.546656
H  -6.087045 0.204263 -0.184569
H  -5.552717 -1.49964 -0.469837
H  -4.827835 -0.26111 -2.492075
H  -4.167285 1.084756 -1.492181
H  2.9116 -0.017742 2.091306
H  1.428273 -1.016594 -1.867423
H  0.927903 3.759007 -0.559305
H  5.265871 -0.184903 1.250277
H  3.770463 -1.171517 -2.709284
H  5.705339 -0.763584 -1.157256
