program: Gaussian 09
title: 000295615
version: EM64L-G09RevD.01
frameworkgroup: C1[X(C12H13NO4)]
method: RPBEPBE
basis: SDD
operation: Freq
keyword: #p
keyword: freq=noraman
keyword: PBEPBE/SDD
title: #p freq=noraman PBEPBE/SDD
converged: YES YES NO NO
title: Mulliken charges:
elementType: O O O O N C C C C C C C C C C C C H H H H H H H H H H H H H
charge: -0.257751 -0.413920 -0.241708 -0.266981 -0.468746 0.473889 -0.400807 -0.388896 -0.378120 0.322087 0.328403 -0.373264 -0.371352 0.132290 0.256797 -0.778734 -0.537465 0.215051 0.224407 0.315720 0.253359 0.243943 0.303713 0.258771 0.257324 0.211682 0.226283 0.226843 0.247397 0.379788
chargesum: 0.00000
title: Mulliken charges with hydrogens summed into heavy atoms:
elementType: O O O O N C C C C C C C C C C C C
charge: -0.257751 -0.034133 -0.241708 -0.266981 -0.165034 0.473889 -0.185755 -0.164489 -0.062400 0.322087 0.328403 -0.119905 -0.127409 0.132290 0.256797 -0.050958 0.163058
polarizability: 3.16945748e+02 4.40215013e+00 1.47030748e+02 -4.13079795e+00 8.58217482e+00 8.34328201e+01
1716.lowfreq: -4.6964 -3.1183 -0.0004 0.0002 0.0005 3.7735 28.6567 35.2114 67.6314
frequency: 28.5430 35.2054 67.6208 71.6301 74.2835 95.2822 120.0805 130.7025 151.5335 188.8903 203.6096 235.6306 260.2587 271.2804 324.9287 341.7343 394.5210 407.1164 424.6406 466.6753 503.4806 514.7909 526.9112 541.3099 557.3128 584.5634 606.5670 634.2294 680.1278 723.6512 734.6200 749.5196 781.9985 822.5060 840.3569 846.6469 921.7432 951.3406 964.8758 982.9760 986.1165 1000.2548 1003.4472 1034.6460 1040.5560 1111.4961 1118.7131 1157.2097 1178.9183 1191.6333 1233.0268 1248.0934 1250.4007 1283.0346 1321.9231 1369.2745 1384.9115 1399.5650 1433.3200 1437.5688 1445.3912 1463.2088 1467.7548 1470.3382 1471.8831 1500.8311 1562.3530 1595.9918 1621.0674 1629.3883 1635.7030 2966.8516 2993.1911 3057.9505 3067.6539 3083.6307 3117.1778 3120.6726 3130.2601 3154.6264 3168.3381 3173.1210 3533.6634 3539.9204
redmass: 6.6245 3.9735 3.5847 1.5574 3.3470 2.4430 5.2369 5.2011 5.4523 6.1055 2.0950 1.9184 3.7503 3.7168 4.4229 4.9772 4.2874 3.3416 3.1417 3.4171 4.8743 1.3554 2.4670 2.5933 3.4883 2.2394 2.6875 6.2687 6.0467 5.1410 4.4671 5.4136 5.8268 1.3081 1.6804 3.4468 1.5937 4.2690 1.4388 8.3134 1.6547 1.3771 2.4866 2.0842 2.2822 1.2598 1.4368 1.3587 2.1526 1.5244 2.3228 2.8822 2.1386 1.6316 1.4531 4.5479 1.2402 2.0945 2.6480 1.3235 1.1722 1.4919 1.0501 1.0868 1.1096 2.4529 6.8913 7.3001 7.0420 6.5917 7.0215 1.0326 1.0371 1.1043 1.0864 1.0987 1.0987 1.0896 1.1000 1.0888 1.0949 1.0965 1.0642 1.0776
irintensity: 2.7388 4.7558 2.5071 0.7891 7.0919 1.1579 0.0848 3.5014 11.4338 1.0400 1.4080 0.9964 6.9096 1.6180 5.3986 1.2998 6.1338 5.5176 2.1684 5.1125 37.3659 20.1414 88.0012 38.0945 17.6188 38.9667 71.5117 12.5810 18.1002 7.3772 2.4206 21.7519 5.7548 7.1539 53.6004 15.2415 36.8537 6.2169 7.6115 59.6183 12.1835 5.5671 7.6615 103.0400 339.9778 0.1795 36.8877 8.1210 5.4423 223.6932 78.2677 101.8191 190.4618 17.5779 7.7938 127.5699 83.6593 387.1743 8.7789 3.8527 69.8734 144.5683 15.0385 35.4297 19.7207 56.5100 2.8783 212.2726 132.5956 97.8334 172.3441 74.8340 13.5112 42.9775 21.9161 16.5686 10.6246 14.6234 25.5340 8.9861 4.2781 31.3551 55.4068 12.5373
temp: 298.150 k
press: 1.00000 atm
elementType: 8 8 8 8 7 6 6 6 6 6 6 6 6 6 6 6 6 1 1 1 1 1 1 1 1 1 1 1 1 1
symmnumber: 1
zpe: 603628.3 jmol-1
zpe.correction: 0.229910 hartree
zpe.thermalcorrener: 0.246905 hartree
zpe.thermalcorrenthalpy: 0.247849 hartree
zpe.thermalcorrgfe: 0.183797 hartree
zpe.sumelectzpe: -819.468437 hartree
zpe.sumelectthermal: -819.451443 hartree
zpe.sumelectthermalent: -819.450498 hartree
zpe.sumelectthermalfe: -819.514550 hartree
dipole: -1.6701 -2.1686 -2.8425
dipole: 3.9461
quadrupole: -80.7872 -87.1362 -105.7120
quadrupole: -18.3910 -11.9290 -1.8677
quadrupole: 10.4246 4.0756 -14.5002 -18.3910 -11.9290 -1.8677
hfenergy: -819.6983473 hartree
pointgroup: C01 [X(C12H13N1O4)]
dipole: 0.6608553 1.3275419 -0.459588 debye
polarizability: 315.3979472|3.4278638|137.0734298|18.5861857|25.1125473|94.9379386 unknown
InChI: InChI=1S/C12H13NO4/c1-8(14)13-11(12(15)16)7-9-3-5-10(17-2)6-4-9/h3-7,13,15H,1-2H3
charge 0 multiplicity 1
30 atoms
O  5.086441 0.38406 0.241147
O  -2.714948 -0.93639 -2.269738
O  -4.144131 -1.162536 0.284046
O  -0.931508 -2.009093 -1.254844
N  -2.989862 0.795512 -0.212341
C  0.835619 0.539798 0.148783
C  -0.61263 0.755605 0.189836
C  1.648169 1.607858 0.655299
C  1.507934 -0.631004 -0.313557
C  3.690123 0.366464 0.183895
C  -1.715165 0.162545 -0.395546
C  3.045876 1.534279 0.669819
C  2.913068 -0.717561 -0.300024
C  -1.719237 -1.030328 -1.285609
C  -4.156138 0.085888 0.086888
C  -5.429582 0.922723 0.122305
C  5.805775 -0.800081 -0.242959
H  -0.883376 1.637691 0.793222
H  1.161924 2.515875 1.033729
H  0.917511 -1.483813 -0.656497
H  3.660218 2.355144 1.051038
H  3.389205 -1.637002 -0.653645
H  -3.045707 1.810731 -0.311033
H  -6.08399 0.54642 0.924256
H  -5.968603 0.800777 -0.834966
H  -5.242687 1.999689 0.280394
H  5.590897 -0.989572 -1.31197
H  5.548744 -1.695806 0.354105
H  6.870867 -0.559662 -0.113702
H  -2.730411 -1.793811 -2.773231
