program: Gaussian 09
title: 000295668
version: EM64L-G09RevD.01
frameworkgroup: C1[X(C21H24N2O3)]
method: RPBEPBE
basis: SDD
operation: Freq
keyword: #p
keyword: freq=noraman
keyword: PBEPBE/SDD
title: #p freq=noraman PBEPBE/SDD
converged: YES YES NO NO
title: Mulliken charges:
elementType: O O O N N C C C C C C C C C C C C C C C C C C C C C H H H H H H H H H H H H H H H H H H H H H H H H
charge: -0.185346 -0.259095 -0.243045 -0.119621 -0.489856 -0.112875 -0.095927 -0.054536 -0.523294 -0.458907 -0.322033 -0.459159 0.160479 -0.377177 -0.523226 0.168241 0.109236 -0.510598 0.190415 0.177742 0.192806 -0.433058 -0.378204 -0.255803 -0.224883 -0.503576 0.227165 0.255715 0.196263 0.181346 0.260492 0.190609 0.216365 0.283130 0.208730 0.252925 0.213743 0.192570 0.253942 0.242056 0.226884 0.207134 0.299439 0.231737 0.229211 0.218126 0.219416 0.237717 0.240525 0.246058
chargesum: 0.00000
title: Mulliken charges with hydrogens summed into heavy atoms:
elementType: O O O N N C C C C C C C C C C C C C C C C C C C C C
charge: -0.185346 -0.259095 -0.243045 -0.119621 -0.190417 0.114291 0.159788 0.141726 -0.081457 -0.051932 -0.038903 0.002496 0.160479 0.029136 -0.027227 0.168241 0.109236 -0.076580 0.190415 0.177742 0.192806 -0.201321 -0.148992 -0.037677 -0.005467 0.220724
polarizability: 3.28269186e+02 -1.03570552e+01 2.41863740e+02 2.43041033e+01 1.96608291e+00 1.71232751e+02
1716.lowfreq: -8.2993 -0.0005 -0.0002 0.0003 2.8883 11.1397 21.9926 26.9894 42.7939
frequency: 21.9707 26.6042 42.7843 52.3397 66.6227 85.9275 102.8099 119.6762 128.4370 142.2564 170.7997 183.6945 192.3767 208.2558 227.7464 251.7535 259.7891 276.5844 306.1837 316.5496 330.6335 343.0551 357.6328 386.4594 407.5851 428.4362 469.6852 479.9364 481.5639 501.4368 508.1173 520.2087 558.5989 576.3547 578.0504 591.9107 635.1480 658.6204 664.3023 706.5011 713.3453 730.3897 731.8467 748.3016 753.9216 764.5790 769.8014 817.0746 848.3894 850.5993 855.2838 872.4781 890.5087 917.2668 928.0359 930.0326 958.2572 968.0769 975.3787 993.9994 997.4623 1006.3801 1011.3538 1022.1809 1041.7454 1053.5772 1066.0823 1085.7975 1103.3408 1108.9117 1112.8286 1115.4955 1127.5840 1134.8428 1141.1658 1148.4535 1158.3690 1168.4676 1180.5411 1192.6394 1206.4654 1220.3502 1229.9138 1234.1021 1240.1594 1255.9567 1262.8483 1276.4082 1284.5170 1292.0298 1298.9930 1306.2930 1311.3812 1323.9785 1326.5660 1331.5322 1343.1772 1345.7036 1356.5110 1364.3555 1371.0601 1391.5145 1409.7479 1420.1271 1436.1572 1441.3762 1452.6484 1454.4274 1457.8673 1460.9974 1462.6192 1472.1630 1477.6999 1481.6977 1491.8015 1580.6781 1601.3317 1617.2587 1633.2785 1636.9493 2746.0078 2824.0626 2857.4969 2955.2266 2972.7022 2980.3069 2984.7337 2998.4587 3003.4472 3006.6334 3021.9216 3022.9992 3037.3768 3054.8446 3060.3151 3061.3241 3080.4746 3109.8194 3121.0622 3128.2002 3142.4503 3153.4686 3160.9273 3608.3841
redmass: 5.1221 5.5962 5.1401 4.5214 7.5471 3.0928 1.2718 4.3745 3.9505 3.1892 3.1286 4.1848 4.0341 2.9264 4.3494 3.8185 3.6080 3.5289 4.7484 3.0695 5.4530 2.9448 2.4125 3.6650 3.5102 2.8897 3.3760 1.2461 3.7474 4.1343 2.6896 3.8350 4.5465 4.4760 3.8509 4.2130 3.1773 5.3536 4.9370 5.1982 4.2764 3.9720 2.9378 1.3907 3.5759 3.0911 3.6324 2.7817 1.5498 4.0460 2.3656 3.5738 2.1139 2.7158 1.3867 3.3650 3.0186 1.2997 3.0431 2.1695 2.2883 2.3176 2.0726 2.1847 2.2754 1.9915 2.3826 2.3830 3.2010 1.9920 1.3758 3.1972 2.1164 2.8784 1.3154 1.4492 1.5048 1.3913 1.9735 1.3795 1.3838 1.2865 1.4535 1.7519 1.7931 1.3743 1.4291 1.3530 1.4484 1.8076 1.4208 1.5105 1.4078 1.4138 1.4905 1.4433 1.4880 1.6018 1.5320 1.8135 1.6222 1.4354 3.7984 1.1891 1.1015 3.1740 1.0502 1.1109 1.1003 1.1044 1.0508 2.2961 1.5557 2.9797 1.0834 6.6765 7.5127 8.6342 7.0369 8.8739 1.0773 1.0705 1.0708 1.0836 1.0601 1.0635 1.0625 1.0629 1.0840 1.0295 1.0957 1.0917 1.0896 1.0979 1.0918 1.0922 1.0991 1.1047 1.0848 1.0890 1.0950 1.1049 1.1000 1.0802
irintensity: 1.5441 0.8754 0.8551 0.8796 2.5124 0.8989 0.8666 0.7797 0.2298 0.5486 4.0050 5.9760 2.5728 0.5155 5.0414 6.0940 1.1132 2.8662 4.1168 1.5212 14.8992 0.7057 1.0490 1.0230 6.0005 10.8937 3.4472 72.5252 1.7268 5.1390 6.3669 6.0084 0.4952 0.1973 3.8307 1.8505 1.5154 5.7480 3.6004 5.9979 6.0427 15.9921 3.1324 82.5647 1.8457 11.9804 5.5567 1.5016 0.5813 9.4814 1.0506 1.8941 9.5443 1.2961 2.6116 0.6460 19.5828 0.0206 4.3862 0.8887 8.2900 15.4977 8.3897 12.6639 5.0911 4.2055 8.9757 19.2988 78.1453 13.1955 29.5724 262.6370 20.0568 28.5285 11.2082 18.3126 11.1890 20.9508 58.1202 8.6735 14.0922 2.9620 9.4463 4.3157 10.0030 17.9611 2.2036 18.1562 3.3713 1.2351 76.5734 72.2980 2.1879 6.2791 26.8350 11.4451 12.9342 71.9332 5.5839 5.0153 19.7444 1.1097 14.2345 24.8987 30.0226 8.2012 15.0996 6.4566 10.3683 3.5551 11.2321 35.6873 11.1047 1.6361 10.7840 1.0937 5.8602 220.9297 1.9810 89.5765 69.0390 83.9202 138.2024 25.3207 39.8121 35.9908 8.6320 26.1421 13.7885 34.2161 22.8944 33.9254 61.4666 33.0939 18.4184 7.0005 16.6587 23.4009 1.8464 3.3804 36.1013 14.1096 38.1396 38.3371
temp: 298.150 k
press: 1.00000 atm
elementType: 8 8 8 7 7 6 6 6 6 6 6 6 6 6 6 6 6 6 6 6 6 6 6 6 6 6 1 1 1 1 1 1 1 1 1 1 1 1 1 1 1 1 1 1 1 1 1 1 1 1
symmnumber: 1
zpe: 1082724.9 jmol-1
zpe.correction: 0.412388 hartree
zpe.thermalcorrener: 0.434882 hartree
zpe.thermalcorrenthalpy: 0.435826 hartree
zpe.thermalcorrgfe: 0.359869 hartree
zpe.sumelectzpe: -1147.914336 hartree
zpe.sumelectthermal: -1147.891842 hartree
zpe.sumelectthermalent: -1147.890898 hartree
zpe.sumelectthermalfe: -1147.966855 hartree
dipole: -1.8100 0.7616 -3.9482
dipole: 4.4096
quadrupole: -152.5269 -142.0625 -159.9294
quadrupole: 3.5646 12.6828 10.1910
quadrupole: -1.0206 9.4437 -8.4231 3.5646 12.6828 10.1910
hfenergy: -1148.3267245 hartree
pointgroup: C01 [X(C21H24N2O3)]
dipole: 0.6494035 0.3842596 1.5621675 debye
polarizability: 326.2444669|10.4844263|240.8936985|30.4937738|-6.4416793|174.2275118 unknown
InChI: InChI=1S/C21H24N2O3/c1-26-21(25)19-15-10-17-20-14(13-4-2-3-5-16(13)22-20)8-9-23(17)11-12(15)6-7-18(19)24/h2-5,12,15,17,19,22H,6-11H2,1H3
charge 0 multiplicity 1
50 atoms
O  3.112987 -1.632464 -2.339306
O  4.798436 -1.857623 1.384371
O  5.157062 0.320213 0.646388
N  -0.260857 1.877187 0.35445
N  -2.400454 -1.227892 0.57287
C  2.006108 0.037582 0.611631
C  2.210769 1.52423 0.200397
C  -0.489127 0.486469 0.840628
C  0.586058 -0.453227 0.2350
C  1.062212 2.374678 0.794525
C  3.092953 -0.912483 -0.007583
C  2.305961 1.693917 -1.335549
C  -1.899423 0.083473 0.494399
C  -1.377888 2.803405 0.679842
C  3.392297 0.772918 -1.962416
C  3.206619 -0.670573 -1.534634
C  -2.908541 0.941714 0.069561
C  -2.661476 2.419734 -0.093154
C  4.440458 -0.710331 0.674853
C  -4.096803 0.138158 -0.139492
C  -3.748781 -1.224048 0.186308
C  -5.421528 0.424599 -0.562255
C  -4.67742 -2.282587 0.097921
C  -6.353533 -0.628639 -0.651594
C  -5.985929 -1.967662 -0.325911
C  6.098952 -1.791992 2.099507
H  2.094818 -0.025103 1.717871
H  3.161637 1.87682 0.646203
H  -0.363097 0.450533 1.962186
H  0.445731 -1.482866 0.622154
H  0.448516 -0.491489 -0.860884
H  1.14863 2.375491 1.914165
H  1.167955 3.422639 0.456592
H  2.80015 -1.965569 0.141859
H  2.557202 2.745942 -1.569898
H  1.320851 1.493032 -1.793582
H  -1.059741 3.824819 0.401627
H  -1.597369 2.806833 1.778414
H  4.384829 1.106095 -1.597135
H  3.382224 0.824459 -3.064262
H  -2.538849 2.682553 -1.162575
H  -3.512969 3.014048 0.293182
H  -1.865472 -2.051918 0.836724
H  -5.715869 1.448882 -0.818244
H  -4.400674 -3.313637 0.346166
H  -7.379052 -0.421162 -0.977348
H  -6.732993 -2.76525 -0.406862
H  6.200142 -2.772998 2.58356
H  6.08514 -0.977581 2.843053
H  6.917049 -1.614426 1.381878
