program: Gaussian 09
title: 000295596
version: EM64L-G09RevD.01
frameworkgroup: C1[X(C17H18ClNO2)]
method: RPBEPBE
basis: SDD
operation: Freq
keyword: #p
keyword: freq=noraman
keyword: PBEPBE/SDD
title: #p freq=noraman PBEPBE/SDD
converged: YES YES NO NO
title: Mulliken charges:
elementType: Cl O O N C C C C C C C C C C C C C C C C C H H H H H H H H H H H H H H H H H H
charge: -0.052331 -0.243239 -0.239124 -0.061272 -0.558234 0.515399 -0.429524 -0.504379 -0.469067 0.209290 0.190520 -0.334238 -0.316945 0.453800 -0.376925 -0.383671 -0.543302 -0.210220 -0.206932 -0.539031 -0.104626 0.206816 0.225462 0.185137 0.227894 0.267379 0.228911 0.238986 0.210819 0.238475 0.282553 0.257878 0.257203 0.217870 0.233179 0.244711 0.245845 0.216402 0.218536
chargesum: 0.00000
title: Mulliken charges with hydrogens summed into heavy atoms:
elementType: Cl O O N C C C C C C C C C C C C C C C C C
charge: -0.052331 -0.243239 -0.239124 -0.061272 -0.125956 0.515399 -0.016494 -0.237001 -0.240157 0.209290 0.190520 -0.095252 -0.106126 0.453800 -0.138450 -0.101118 0.152458 0.047657 0.050270 0.141751 -0.104626
polarizability: 2.74591185e+02 4.68924558e+01 2.21755948e+02 3.05601387e+01 -1.33199745e+01 1.54751371e+02
1716.lowfreq: -12.0926 -5.5617 0.0012 0.0012 0.0015 1.1751 10.9855 21.1392 21.5752
frequency: 10.9093 20.5428 21.5494 57.3774 61.1787 75.8218 93.5929 115.0525 140.7322 160.0336 180.3384 182.7886 212.0668 222.3695 247.4857 262.4145 284.1372 289.0283 325.3977 350.4878 357.1301 370.9561 401.8136 412.8225 439.7199 453.2829 469.8332 491.7787 521.0751 536.7812 578.0616 622.8132 635.8954 673.6410 688.3103 717.0533 730.0547 740.4424 800.0252 827.2786 833.7656 844.2827 867.2664 872.0012 875.2655 912.0571 941.2513 962.5885 983.5608 987.9386 993.5532 998.7998 1007.4279 1013.7522 1044.0500 1068.0980 1105.4916 1111.3355 1111.7490 1131.8951 1142.5989 1157.0233 1173.0083 1175.7930 1187.2533 1214.2177 1222.5739 1234.5237 1261.5791 1281.9142 1289.5950 1307.4463 1334.9142 1355.3009 1391.3133 1396.4905 1398.8567 1409.7111 1435.3327 1444.0359 1457.8303 1465.3334 1465.5505 1465.8264 1471.0648 1472.6648 1475.1220 1508.8437 1576.1358 1590.2676 1597.3441 1611.4424 1626.4183 2909.4652 2931.4424 2952.8263 2956.9514 2993.3204 3019.3574 3038.4337 3044.4592 3055.0757 3123.1962 3124.7837 3125.7971 3131.4404 3152.9995 3156.4648 3160.5247 3171.4766 3174.6857
redmass: 6.2031 3.8501 5.0619 6.0823 5.0034 4.5429 3.4641 4.2743 3.9808 3.3668 3.5191 3.8006 3.1686 1.4219 1.4589 3.0465 3.8685 2.8034 3.9624 3.1679 3.7815 4.2321 3.6064 2.9439 4.0656 4.4527 3.7840 3.6978 3.8787 3.8934 3.7932 7.0018 3.7240 6.0518 4.5207 3.5699 4.9651 3.3397 1.4661 1.3551 3.6445 1.3337 2.4176 1.5011 3.5708 1.3577 1.7805 1.7321 3.2851 2.4133 1.7358 3.9468 3.1640 3.2583 2.0351 2.7706 1.3483 1.2623 1.2612 2.1754 1.5639 1.4027 1.3626 1.2423 1.2411 1.3072 1.9733 1.9389 3.3913 1.4264 1.2992 1.3174 1.4534 2.3483 3.1031 4.0669 2.6080 2.7492 1.1803 1.3757 1.1048 1.0598 1.0739 1.0806 1.0974 1.0601 2.4924 2.6731 7.9333 7.0661 6.1319 6.6189 7.0800 1.0662 1.0855 1.0333 1.0331 1.0618 1.0922 1.1036 1.1037 1.1023 1.0972 1.0986 1.0909 1.0899 1.0885 1.0910 1.0938 1.0955 1.0970
irintensity: 0.0293 1.0218 0.0844 0.7104 0.4754 6.8030 8.6747 1.7053 3.9531 0.4706 4.7820 3.4433 9.2961 0.1414 1.0020 2.7118 2.8410 5.7486 6.6570 2.3353 4.1032 1.2680 3.5502 0.0190 14.3199 2.1407 4.9773 35.2887 1.4636 12.6831 4.1609 0.2132 14.8644 10.1999 1.0277 1.2396 16.8348 0.8822 43.4478 35.2220 14.5125 26.5449 10.1787 25.8675 1.7088 0.3357 11.7855 2.4694 22.2070 32.1896 10.4487 30.8422 24.6818 1.4203 7.1416 50.1278 10.8397 0.1828 0.2069 150.6316 4.7768 9.0173 11.2891 2.6053 14.3122 6.3130 88.5219 11.4073 139.4396 16.4368 8.4664 17.5069 7.6928 4.8523 4.6084 3.6229 13.2454 17.8220 12.0355 5.9171 32.3207 1.1198 30.1836 4.7649 62.9867 22.2959 68.8584 118.5592 10.7794 32.8790 45.7019 17.7195 41.9999 73.6252 68.4113 95.5382 36.8012 28.5516 59.9090 49.4374 46.6606 24.7029 32.9460 23.7029 0.6679 8.0802 0.0728 18.0799 6.4644 5.2345 2.2967
temp: 298.150 k
press: 1.00000 atm
elementType: 17 8 8 7 6 6 6 6 6 6 6 6 6 6 6 6 6 6 6 6 6 1 1 1 1 1 1 1 1 1 1 1 1 1 1 1 1 1 1
symmnumber: 1
zpe: 809083.7 jmol-1
zpe.correction: 0.308164 hartree
zpe.thermalcorrener: 0.328710 hartree
zpe.thermalcorrenthalpy: 0.329655 hartree
zpe.thermalcorrgfe: 0.255553 hartree
zpe.sumelectzpe: -1322.289164 hartree
zpe.sumelectthermal: -1322.268617 hartree
zpe.sumelectthermalent: -1322.267673 hartree
zpe.sumelectthermalfe: -1322.341774 hartree
dipole: 2.0142 1.5065 1.5679
dipole: 2.9639
quadrupole: -127.8327 -130.2839 -121.4342
quadrupole: 1.0753 9.3130 -1.8695
quadrupole: -1.3157 -3.7670 5.0827 1.0753 9.3130 -1.8695
hfenergy: -1322.5973274 hartree
pointgroup: C01 [X(C17H18Cl1N1O2)]
dipole: 0.6254291 0.8371612 0.5174535 debye
polarizability: 252.1745735|62.3171858|227.8690911|30.9557026|-18.5071327|171.0548396 unknown
InChI: InChI=1S/C17H18ClNO2/c1-20-16-8-5-13(11-17(16)21-2)9-10-19-12-14-3-6-15(18)7-4-14/h3-8,11-12H,9-10H2,1-2H3
charge 0 multiplicity 1
39 atoms
Cl -5.812784 -2.492642 -0.318272
O  1.706855 -2.140462 -0.280259
O  3.786994 -1.814095 1.330501
N  -0.886192 2.32272 -0.851454
C  1.520387 2.788054 -1.324447
C  2.153811 1.595739 -0.626357
C  0.207413 3.285769 -0.639792
C  1.624814 0.289103 -0.81418
C  3.256634 1.756736 0.238702
C  2.176539 -0.827755 -0.153609
C  3.297808 -0.650843 0.721128
C  3.826337 0.644334 0.906159
C  -1.395363 1.708074 0.181397
C  -2.468418 0.699817 0.046538
C  -2.95204 0.027617 1.200191
C  -3.025743 0.379901 -1.223017
C  0.546551 -2.352931 -1.149472
C  -3.96902 -0.946789 1.100418
C  -4.041422 -0.588138 -1.339377
C  4.94102 -1.663354 2.216914
C  -4.497551 -1.238293 -0.171728
H  2.229976 3.636738 -1.339592
H  1.275631 2.544739 -2.375636
H  0.411969 3.488382 0.437544
H  -0.087844 4.236505 -1.125036
H  0.770048 0.161279 -1.484922
H  3.686985 2.753315 0.392935
H  4.686218 0.797785 1.565238
H  -1.039763 1.900538 1.218495
H  -2.528496 0.262902 2.184018
H  -2.647378 0.908702 -2.103693
H  -4.340623 -1.46626 1.988082
H  -4.475835 -0.83482 -2.312484
H  0.770744 -2.072311 -2.197359
H  -0.335025 -1.783419 -0.795203
H  0.341838 -3.431835 -1.089545
H  5.155771 -2.679642 2.578475
H  4.70956 -1.002368 3.075708
H  5.820892 -1.266591 1.672693
