program: Gaussian 09
title: 000295619
version: EM64L-G09RevD.01
frameworkgroup: C1[X(C18H20O5)]
method: RPBEPBE
basis: SDD
operation: Freq
keyword: #pfreq=noraman
keyword: PBEPBE/SDD
title: #p freq=noraman PBEPBE/SDD
converged: YES YES NO NO
title: Mulliken charges:
elementType: O O O O O C C C C C C C C C C C C C C C C C C H H H H H H H H H H H H H H H H H H H H
charge: -0.420008 -0.417242 -0.246388 -0.224243 -0.265130 0.054457 -0.193351 0.239360 -0.519328 0.139758 -0.541890 -0.554535 -0.758943 0.171460 -0.634960 0.418626 0.148376 0.116518 -0.389537 -0.596016 -0.408251 0.332945 -0.536363 0.269150 0.214395 0.265556 0.255266 0.223253 0.227422 0.259481 0.234349 0.256733 0.242849 0.223104 0.229931 0.245250 0.260366 0.238908 0.380753 0.372986 0.221113 0.219977 0.243843
chargesum: 0.00000
title: Mulliken charges with hydrogens summed into heavy atoms:
elementType: O O O O O C C C C C C C C C C C C C C C C C C
charge: -0.039255 -0.044256 -0.246388 -0.224243 -0.265130 0.054457 0.075799 0.239360 -0.039377 0.139758 -0.063371 -0.067632 -0.025012 0.171460 -0.181925 0.418626 0.148376 0.116518 -0.144288 -0.335651 -0.169343 0.332945 0.148570
polarizability: 3.15948481e+02 -2.03322887e+01 1.98588031e+02 5.03443808e-01 -1.37312602e+01 1.47807981e+02
1716.lowfreq: -7.2172 0.0007 0.0007 0.0007 4.4587 10.5189 32.0063 33.5987 44.0443
frequency: 31.9253 33.5837 44.0080 57.2909 77.1006 88.0901 111.0757 132.7883 169.3529 185.4996 189.9531 222.7811 231.5297 237.0086 247.2026 261.3695 271.1798 282.6117 303.8255 310.1359 337.5601 358.4984 376.3992 399.9463 424.3601 443.9079 448.2813 458.3818 502.4285 516.6878 553.3712 559.5285 574.1592 592.8797 611.0604 623.4564 633.0737 653.9543 684.1025 710.9763 717.5344 727.4243 750.4858 777.3150 797.0595 807.4229 856.7737 873.4533 882.9724 886.9788 897.3438 923.0471 938.0231 958.5031 984.4262 1009.3068 1024.3971 1035.8792 1040.5076 1050.3351 1055.0597 1092.2617 1111.5795 1112.2801 1118.5446 1131.8377 1146.1096 1151.9872 1162.3663 1184.2920 1186.2465 1193.0795 1227.9810 1235.9673 1241.8068 1254.4315 1276.3982 1281.0206 1286.2796 1304.0000 1318.5549 1349.0143 1355.8693 1368.1395 1373.5278 1381.4395 1390.5477 1430.6929 1445.4874 1450.5396 1457.7049 1461.5267 1465.2568 1474.1986 1474.4629 1479.9477 1487.0734 1496.1874 1568.4275 1623.9810 1629.1917 1632.7251 1656.2286 2949.9751 2957.9885 2960.3037 2975.7452 2999.0542 3007.3174 3022.6126 3042.8364 3045.2370 3048.0370 3061.5763 3079.9303 3093.5330 3123.2079 3127.6397 3143.0687 3146.2296 3165.3020 3495.7736 3499.4455
redmass: 6.3038 8.3377 4.9842 7.0853 4.3484 4.6662 4.5251 5.7022 4.2486 3.1947 3.0825 2.8121 1.8860 2.0292 3.2814 5.9576 1.1714 2.6840 2.4502 2.4877 3.9565 4.3811 5.1184 3.8940 4.1214 3.3838 4.1630 3.1217 3.5437 4.4999 4.4028 4.0772 3.6425 2.1932 1.7718 2.7540 1.4327 3.3701 3.1124 5.3743 3.7922 4.7725 3.5368 4.3247 2.7162 1.5198 2.2927 2.8801 2.6268 1.5757 2.5599 2.2974 1.5669 2.5530 2.8588 3.1902 2.6567 2.4431 2.5964 1.9411 2.5084 2.8911 1.2712 2.6123 2.1738 1.8992 1.5312 1.5994 1.2392 2.8562 1.4242 1.2794 1.5387 1.5623 1.6910 2.5224 1.8547 1.7399 1.6820 1.5205 1.5879 1.5960 1.4716 2.0676 1.8045 3.5308 1.1855 1.4800 2.1437 1.1248 1.1107 1.0859 1.0515 1.0842 1.0902 1.0565 1.0656 2.6913 6.9175 6.8736 8.3759 7.7364 7.6113 1.0692 1.0330 1.0642 1.0594 1.0372 1.0659 1.0984 1.0941 1.1038 1.0928 1.0850 1.0985 1.0997 1.0993 1.0983 1.0869 1.0916 1.0955 1.0637 1.0638
irintensity: 1.4558 1.2711 0.6680 1.3808 1.9304 2.0882 2.8370 0.2455 1.5575 0.2499 0.6764 0.0353 1.2804 1.9029 3.1620 1.1251 0.1505 3.4106 3.8540 7.9990 3.2448 2.2678 3.5634 2.2707 0.4869 13.1077 1.6314 3.8809 6.4441 7.6866 11.6050 17.8435 81.3850 25.5327 54.5402 53.2850 80.4169 4.2077 7.2766 20.4788 36.3174 25.2365 0.7630 3.6940 16.3477 34.5050 7.1023 2.7425 2.7678 32.6084 6.1822 11.6443 5.8530 31.5732 24.2941 87.6511 110.4900 50.2213 215.2213 24.6510 195.5989 27.1028 0.0562 9.3519 16.1792 27.1206 19.7629 60.8247 3.3145 6.8066 27.6910 7.6765 21.5312 28.5545 59.4252 46.2844 48.2397 27.8737 8.5161 22.7733 2.5256 33.7950 3.5514 21.0484 13.3384 5.5577 26.8199 39.8332 31.8504 11.0256 14.9752 15.2846 13.1984 14.4727 31.1074 8.5382 17.6147 49.1062 56.8717 128.1045 126.1236 76.0798 145.3996 19.7166 87.3829 36.6118 26.5862 23.5127 39.3915 18.7835 30.8404 49.9548 6.6724 10.8902 9.1989 17.7145 29.9229 9.8880 14.6226 4.4604 17.0103 24.2307 29.0145
temp: 298.150 k
press: 1.00000 atm
elementType: 8 8 8 8 8 6 6 6 6 6 6 6 6 6 6 6 6 6 6 6 6 6 6 1 1 1 1 1 1 1 1 1 1 1 1 1 1 1 1 1 1 1 1
symmnumber: 1
zpe: 905331.4 jmol-1
zpe.correction: 0.344823 hartree
zpe.thermalcorrener: 0.366064 hartree
zpe.thermalcorrenthalpy: 0.367009 hartree
zpe.thermalcorrgfe: 0.294787 hartree
zpe.sumelectzpe: -1072.348414 hartree
zpe.sumelectthermal: -1072.327172 hartree
zpe.sumelectthermalent: -1072.326227 hartree
zpe.sumelectthermalfe: -1072.398449 hartree
dipole: 0.0236 -1.7933 1.5614
dipole: 2.3779
quadrupole: -116.6544 -133.0170 -130.1782
quadrupole: -4.1465 0.9012 1.1751
quadrupole: 9.9621 -6.4004 -3.5617 -4.1465 0.9012 1.1751
hfenergy: -1072.693236 hartree
pointgroup: C01 [X(C18H20O5)]
dipole: 0.0064529 0.698391 0.6224709 debye
polarizability: 315.4752081|-21.3134461|198.6849971|-2.9204198|14.6245004|148.1842878 unknown
InChI: InChI=1S/C18H20O5/c1-18(17(21)22)14-7-3-10-9-11(23-2)4-5-12(10)13(14)6-8-15(18)16(19)20/h4-5,9,15,19,21H,3,6-8H2,1-2H3
charge 0 multiplicity 1
43 atoms
O  3.291539 -1.49503 1.835994
O  4.425003 2.216168 -0.933789
O  2.954121 -2.934513 0.066093
O  2.151547 2.543691 -1.224123
O  -5.620309 -0.185463 -0.215582
C  2.413143 -0.528442 -0.275312
C  2.967468 0.798482 0.367523
C  0.865708 -0.614041 -0.257452
C  2.105222 1.27286 1.567174
C  0.064358 0.297912 0.390706
C  0.626907 1.46132 1.190734
C  0.227017 -1.735513 -1.077091
C  2.949587 -0.686616 -1.733106
C  -1.413032 0.214177 0.250409
C  -1.114449 -2.188752 -0.465204
C  -2.022588 -1.001659 -0.199736
C  2.90931 -1.765101 0.512421
C  3.077025 1.912379 -0.665246
C  -2.258946 1.310261 0.555804
C  -3.416532 -1.087803 -0.338915
C  -3.662405 1.232432 0.417422
C  -4.243222 0.023599 -0.034412
C  -6.51711 0.932148 0.085345
H  3.993872 0.600843 0.71806
H  2.518115 2.217247 1.969927
H  2.199856 0.508821 2.356537
H  0.504512 2.390138 0.599216
H  0.035111 1.593904 2.117231
H  0.060404 -1.37877 -2.116085
H  0.906916 -2.603395 -1.143381
H  4.045511 -0.546534 -1.756853
H  2.727014 -1.689735 -2.12552
H  2.480528 0.064651 -2.390665
H  -0.908306 -2.705751 0.496285
H  -1.611123 -2.923463 -1.124698
H  -1.824176 2.256647 0.892538
H  -3.891483 -2.013849 -0.67991
H  -4.277537 2.105054 0.655682
H  3.554823 -2.353463 2.267553
H  4.461913 2.955838 -1.601163
H  -6.305442 1.805141 -0.562641
H  -6.442283 1.234022 1.148442
H  -7.528784 0.553457 -0.122015
