program: Gaussian 09
title: 000295583
version: EM64L-G09RevD.01
frameworkgroup: C1[X(C13H18N2S2)]
method: RPBEPBE
basis: SDD
operation: Freq
keyword: #p
keyword: freq=noraman
keyword: PBEPBE/SDD
title: #p freq=noraman PBEPBE/SDD
converged: YES YES NO NO
title: Mulliken charges:
elementType: S S N N C C C C C C C C C C C C C H H H H H H H H H H H H H H H H H H
charge: 0.233238 0.021052 -0.000436 -0.010092 -0.043652 -0.322263 -0.694690 -0.551021 -0.707197 -0.680137 -0.559361 0.502665 -0.345941 -0.446003 -0.225844 -0.218280 -0.241371 0.218895 0.245761 0.256862 0.254203 0.311219 0.267367 0.234156 0.219098 0.218215 0.241885 0.241197 0.216433 0.210808 0.232318 0.233713 0.228690 0.228010 0.230501
chargesum: 0.00000
title: Mulliken charges with hydrogens summed into heavy atoms:
elementType: S S N N C C C C C C C C C C C C C
charge: 0.233238 0.021052 -0.000436 -0.010092 0.175244 0.180361 -0.129268 -0.049499 -0.027999 -0.011699 -0.559361 0.502665 -0.113623 -0.212290 0.002846 0.009731 -0.010869
polarizability: 2.05991894e+02 -2.52586653e+01 2.07287703e+02 8.67696880e+00 8.25107772e+00 1.51353270e+02
1716.lowfreq: -10.7331 -8.3295 -0.0015 0.0016 0.0020 4.0383 9.3206 23.9092 46.2713
frequency: -3.7233 23.6621 46.1786 49.3448 71.7367 110.2902 132.6065 172.2557 204.5774 209.2877 240.6736 247.0906 256.7477 286.7403 304.5705 312.5792 342.9250 357.4264 375.3706 403.3701 448.7351 481.9443 508.6806 525.9444 534.7446 562.4063 587.9866 617.4094 649.2738 704.4424 746.7920 755.0234 812.8520 855.0362 871.7019 881.3040 903.9794 914.3018 918.2145 938.5375 952.6115 973.0965 978.9158 990.4939 997.9331 1008.9341 1026.5914 1048.1841 1086.1936 1115.4954 1125.5306 1158.2222 1159.7763 1173.0575 1186.4656 1190.2016 1207.8427 1220.6885 1242.6296 1281.4714 1292.3621 1310.2293 1315.5718 1337.5414 1347.2518 1364.6603 1379.0184 1386.7250 1396.7907 1424.4217 1441.9382 1444.8326 1462.3870 1465.7846 1474.6001 1477.4004 1480.7032 1486.4472 1489.0688 1594.7475 1614.7547 2913.9734 2974.3504 2983.4340 2986.3909 2993.0652 3028.6835 3049.7856 3064.5239 3075.0812 3082.1326 3088.6215 3096.1263 3115.1850 3123.8548 3133.6879 3135.6429 3147.1982 3164.4878
redmass: 4.0172 4.4198 4.4018 5.1225 3.5066 4.9195 3.1032 4.1113 1.6370 2.2760 2.4029 2.7279 1.2145 3.6156 3.4921 4.7341 2.7663 4.5459 2.8185 2.8086 3.6605 3.1467 3.3122 4.7936 6.3904 7.2449 3.8731 6.3367 5.1377 1.8771 2.2332 2.1693 3.7398 1.2506 2.6974 3.4515 1.7385 1.2612 1.5128 1.4203 3.5291 1.8927 1.4007 5.7322 1.3568 2.1097 2.1731 2.5729 1.5623 1.7546 2.2975 2.1805 2.5955 1.0571 1.1741 1.8564 1.6343 2.2707 1.7238 1.3367 1.2819 1.3733 1.3637 1.9000 1.3494 1.6607 1.2063 5.3588 1.2290 1.3587 1.7040 1.3464 1.0509 1.0806 1.2206 1.0571 1.0722 1.8416 1.0657 6.0958 6.0690 1.0698 1.0602 1.0366 1.0367 1.0841 1.1007 1.0572 1.0919 1.0990 1.0983 1.0998 1.1005 1.0876 1.0861 1.1114 1.0911 1.0961 1.1015
irintensity: 0.1763 0.6538 1.2808 1.0303 0.0051 0.4061 1.2000 2.2027 1.8134 0.9723 13.2383 0.4145 0.1460 0.7286 5.3946 13.7193 3.5931 4.0751 11.8435 0.5722 10.7986 0.3952 10.8516 43.4576 18.5004 11.5231 19.7951 0.6288 2.8823 49.3171 18.3133 25.4255 15.4315 0.4753 8.8491 27.3047 8.6718 3.6980 5.1573 3.5463 113.6898 38.2757 0.7845 0.8475 1.6637 9.9704 7.5068 8.2155 15.8096 86.9578 9.3550 21.4575 84.4317 0.2243 4.3535 16.4263 80.4126 49.8669 52.3622 14.0608 22.8008 5.1444 17.8822 131.6320 1.5092 98.7977 23.4839 2.9426 30.8061 11.1481 19.3472 5.4790 2.3542 7.0829 21.2719 19.3578 15.6949 8.1456 11.4965 1.3790 5.8666 40.3019 40.3287 16.6165 19.9571 16.6357 32.8346 22.5842 12.3613 1.3305 85.8577 22.7575 31.0258 8.2160 2.9222 7.3137 11.5701 38.6968 22.1106
temp: 298.150 k
press: 1.00000 atm
elementType: 16 16 7 7 6 6 6 6 6 6 6 6 6 6 6 6 6 1 1 1 1 1 1 1 1 1 1 1 1 1 1 1 1 1 1
symmnumber: 1
zpe: 751461.4 jmol-1
zpe.correction: 0.286217 hartree
zpe.thermalcorrener: 0.302777 hartree
zpe.thermalcorrenthalpy: 0.303721 hartree
zpe.thermalcorrgfe: 0.241068 hartree
zpe.sumelectzpe: -1410.507670 hartree
zpe.sumelectthermal: -1410.491109 hartree
zpe.sumelectthermalent: -1410.490165 hartree
zpe.sumelectthermalfe: -1410.552818 hartree
dipole: -2.0142 6.2919 -0.4024
dipole: 6.6187
quadrupole: -116.0120 -128.9866 -108.8171
quadrupole: 9.8799 1.4998 -0.1626
quadrupole: 1.9266 -11.0480 9.1215 9.8799 1.4998 -0.1626
hfenergy: -1410.7938861 hartree
pointgroup: C01 [X(C13H18N2S2)]
dipole: 0.1299839 2.5481055 0.5205622 debye
polarizability: 187.1357012|-22.241852|217.6440211|9.2520121|19.6097836|159.8531451 unknown
InChI: InChI=1S/C13H18N2S2/c1-11(2)15-9-14(13(16)17-10-15)8-12-6-4-3-5-7-12/h3-7,11H,8-10H2,1-2H3
charge 0 multiplicity 1
35 atoms
S  2.470552 -2.369432 0.222384
S  0.302441 -3.745338 -1.469208
N  1.756809 0.392086 0.591564
N  0.385167 -1.047581 -0.906882
C  2.895441 1.366302 0.673595
C  1.21838 0.171388 -0.78019
C  1.882316 -0.823043 1.337419
C  -0.960783 -0.861816 -1.520189
C  2.45317 2.743854 0.134945
C  4.216636 0.890783 0.006458
C  0.942323 -2.316961 -0.794584
C  -1.849107 0.069009 -0.708187
C  -2.085394 -0.180106 0.668287
C  -2.488186 1.173206 -1.323742
C  -2.944301 0.656197 1.411863
C  -3.352806 2.011723 -0.581933
C  -3.5820 1.756005 0.788746
H  3.086221 1.480846 1.758993
H  2.065552 0.072061 -1.496543
H  0.596255 1.030821 -1.075965
H  2.608952 -0.738488 2.159207
H  0.913684 -1.193548 1.702746
H  -1.395666 -1.875932 -1.598661
H  -0.845861 -0.483971 -2.555838
H  3.228623 3.499004 0.354619
H  2.311306 2.729151 -0.96154
H  1.507942 3.06084 0.608767
H  4.529396 -0.099539 0.380966
H  5.020933 1.615495 0.229926
H  4.127707 0.822641 -1.092746
H  -1.598345 -1.035873 1.150847
H  -2.315811 1.37421 -2.388856
H  -3.121548 0.450864 2.473556
H  -3.843449 2.860448 -1.071506
H  -4.250551 2.404394 1.365979
