program: Gaussian 09
title: 000295578
version: EM64L-G09RevD.01
frameworkgroup: C1[X(C12H11NO3S2)]
method: RPBEPBE
basis: SDD
operation: Freq
keyword: #p
keyword: freq=noraman
keyword: PBEPBE/SDD
title: #p freq=noraman PBEPBE/SDD
converged: YES YES NO NO
title: Mulliken charges:
elementType: S S O O O N C C C C C C C C C C C C H H H H H H H H H H H
charge: 0.296408 0.143129 -0.227569 -0.213153 -0.434543 -0.243645 0.532429 0.246925 -0.254806 -0.560143 -0.461709 -0.364801 0.325110 -0.165872 -0.063026 -0.409191 -0.231064 -0.665055 0.273572 0.261925 0.229896 0.265383 0.223487 0.224703 0.221976 0.215221 0.238429 0.239391 0.356593
chargesum: 0.00000
title: Mulliken charges with hydrogens summed into heavy atoms:
elementType: S S O O O N C C C C C C C C C C C C
charge: 0.296408 0.143129 -0.227569 -0.213153 -0.077950 -0.243645 0.532429 0.246925 -0.254806 -0.560143 -0.188137 -0.102876 0.325110 0.064024 0.202358 -0.185704 0.215615 0.027986
polarizability: 3.03068357e+02 2.29810978e+01 1.89470045e+02 2.27725050e+00 3.25940189e+00 1.12248592e+02
1716.lowfreq: -24.4917 -5.6390 -0.0017 0.0013 0.0014 2.1887 6.4673 24.9265 35.3686
frequency: -23.2443 24.8912 35.2788 49.4153 64.2909 83.2219 105.0065 131.9398 193.1485 221.3268 226.8729 233.1910 240.4485 245.2138 275.8358 314.4189 337.8753 354.3155 398.6232 418.9770 443.0521 446.7499 455.1543 515.6361 519.6894 541.6942 579.8583 594.3203 647.6215 678.9957 713.8833 729.8434 749.9597 782.8657 807.3543 839.7009 864.9418 873.9908 882.8952 908.0523 961.4028 979.5250 986.2797 1020.8578 1053.0287 1087.4711 1103.7702 1130.3009 1138.6061 1147.0321 1173.7608 1194.3903 1229.8518 1258.7259 1259.8532 1298.9874 1301.0073 1319.5132 1365.1541 1397.0098 1402.2058 1460.6739 1470.2295 1472.2184 1476.0547 1484.7774 1600.9822 1616.1427 1628.3509 1652.1336 2982.5250 3002.1253 3048.0556 3099.5766 3103.6741 3113.2488 3121.0608 3153.4196 3180.0055 3185.8427 3586.2984
redmass: 1.9605 6.1483 5.1356 4.8206 8.8096 6.6026 5.1208 8.2567 7.0368 4.3522 3.2217 4.4516 2.1554 2.4316 6.8638 12.7573 6.5260 1.1332 15.5688 3.9819 4.3638 4.3402 3.2479 7.3688 16.2110 8.3465 6.2242 7.8543 6.2874 2.2906 8.2074 4.2400 5.7251 1.6692 1.0945 3.4217 1.4756 1.4400 1.7062 4.7353 1.3409 8.7714 6.1652 2.5002 3.5078 1.6365 2.5803 1.4514 1.6520 2.6775 1.1207 2.2379 8.3774 1.1797 3.7526 1.3353 1.3090 6.7873 1.3309 8.4362 1.2551 1.0389 2.8892 1.0795 2.6909 1.0657 7.1725 10.8100 6.8935 7.2990 1.0556 1.0367 1.1087 1.0989 1.0916 1.1021 1.0893 1.0920 1.0969 1.0942 1.0661
irintensity: 0.3953 0.6807 3.8773 2.7598 0.0417 2.1933 1.7365 0.0230 1.4698 3.5836 3.4635 2.8484 3.0001 2.4199 6.6545 4.1408 8.3508 134.8221 0.4630 13.1686 7.7896 2.3967 4.3191 2.9765 8.5661 7.1287 2.1399 26.6851 23.5079 22.9741 12.3333 42.6667 42.3398 36.6168 4.4866 47.7444 14.4160 9.1921 4.3800 45.0459 0.6979 4.1020 9.4843 76.4863 87.6088 13.4132 341.9329 13.1490 118.8224 502.8875 58.6369 274.8634 153.3242 5.8156 126.6164 18.5131 32.9724 59.5839 74.1926 18.8709 53.7074 13.2521 10.7222 29.9986 77.1676 8.2562 52.5496 130.2097 250.3992 352.4383 58.9451 19.3953 23.1144 28.9772 4.9821 30.7176 14.4457 17.7938 2.8241 0.2431 43.6618
temp: 298.150 k
press: 1.00000 atm
elementType: 16 16 8 8 8 7 6 6 6 6 6 6 6 6 6 6 6 6 1 1 1 1 1 1 1 1 1 1 1
symmnumber: 1
zpe: 542965.1 jmol-1
zpe.correction: 0.206804 hartree
zpe.thermalcorrener: 0.223750 hartree
zpe.thermalcorrenthalpy: 0.224694 hartree
zpe.thermalcorrgfe: 0.160238 hartree
zpe.sumelectzpe: -1539.106052 hartree
zpe.sumelectthermal: -1539.089107 hartree
zpe.sumelectthermalent: -1539.088162 hartree
zpe.sumelectthermalfe: -1539.152619 hartree
dipole: -2.4223 -3.1986 1.4225
dipole: 4.2570
quadrupole: -63.7971 -129.7460 -119.4049
quadrupole: 6.2258 3.0112 4.3994
quadrupole: 40.5189 -25.4300 -15.0889 6.2258 3.0112 4.3994
hfenergy: -1539.3128569 hartree
pointgroup: C01 [X(C12H11N1O3S2)]
dipole: -0.9206707 -1.0963524 0.8691239 debye
polarizability: 302.4198778|23.1669884|186.9442124|-8.6646999|-15.5726306|115.4229041 unknown
InChI: InChI=1S/C12H11NO3S2/c1-2-16-7-10-11(15)13(12(17)18-10)8-4-3-5-9(14)6-8/h3-7,14H,2H2,1H3
charge 0 multiplicity 1
29 atoms
S  -1.9008 1.650239 -0.735656
S  0.829973 2.952703 -1.33082
O  -4.290512 -0.240965 0.098595
O  -0.244898 -1.59912 0.826628
O  4.311221 -2.217921 -1.14935
N  0.414356 0.485658 -0.124106
C  1.83141 0.224529 0.055097
C  -0.55598 -0.49695 0.303341
C  -1.91417 0.001589 0.034239
C  -0.058729 1.669432 -0.707098
C  2.411495 -0.858531 -0.630188
C  2.5880 1.042463 0.924872
C  3.785072 -1.126033 -0.439619
C  3.958592 0.761556 1.098083
C  -3.029053 -0.724079 0.347301
C  4.566699 -0.319359 0.421395
C  -5.430199 -1.136327 0.467871
C  -6.712606 -0.372964 0.161052
H  1.825003 -1.496728 -1.295206
H  2.113836 1.879471 1.443405
H  4.560323 1.387155 1.765256
H  -2.915538 -1.715629 0.809354
H  5.634344 -0.530005 0.56432
H  -5.349365 -2.064253 -0.130426
H  -5.344953 -1.383905 1.543738
H  -7.589571 -0.995967 0.413249
H  -6.763785 0.557954 0.750083
H  -6.765374 -0.112408 -0.909276
H  5.274913 -2.333206 -0.958433
