program: Gaussian 09
title: 000295576
version: EM64L-G09RevD.01
frameworkgroup: C1[X(C12H10N2O)]
method: RPBEPBE
basis: SDD
operation: Freq
keyword: #p
keyword: freq=noraman
keyword: PBEPBE/SDD
title: #p freq=noraman PBEPBE/SDD
converged: YES YES NO NO
title: Mulliken charges:
elementType: O N N C C C C C C C C C C C C H H H H H H H H H H
charge: -0.247702 -0.001080 -0.018783 0.343162 0.486668 -0.378283 -0.367038 -0.380121 -0.319354 -0.251623 -0.352227 -0.679615 0.278062 -0.246081 -0.251574 0.261333 0.256838 0.237270 0.256132 0.219148 0.218956 0.250408 0.214669 0.235400 0.235436
chargesum: 0.00000
title: Mulliken charges with hydrogens summed into heavy atoms:
elementType: O N N C C C C C C C C C C C C
charge: -0.247702 -0.001080 -0.018783 0.343162 0.486668 -0.116951 -0.110200 -0.142851 -0.063223 0.186480 -0.101818 0.005890 0.278062 -0.246081 -0.251574
polarizability: 3.13104557e+02 -4.57875850e+00 1.45427552e+02 -2.24831841e-02 2.51352108e-02 6.58204064e+01
1716.lowfreq: -9.2232 -4.3548 -3.1738 -0.0008 -0.0006 -0.0002 36.7012 44.0656 78.3067
frequency: 36.6944 43.9879 78.2994 84.8320 114.7630 130.9868 141.5947 174.3969 213.6571 235.5537 269.8997 288.3381 356.7126 369.8295 416.0283 437.9181 459.3563 461.8729 534.1984 589.6953 597.3918 624.4262 648.7326 739.7132 756.6742 776.5163 810.2016 828.2317 841.5170 853.4303 898.4478 943.9355 967.9392 975.8753 996.7197 1028.1402 1114.5158 1124.4375 1133.0918 1157.1980 1185.9017 1241.8787 1256.1966 1263.1314 1316.6607 1351.6445 1365.6102 1392.9855 1401.7506 1443.8632 1460.9328 1473.6100 1484.3233 1500.4255 1556.6362 1580.4653 1621.1175 2158.6385 2171.5896 2970.5377 3001.0392 3033.3013 3098.4005 3111.2863 3113.6094 3130.1206 3162.1820 3174.5380 3187.0240
redmass: 5.4309 3.6901 6.0329 5.2186 1.7638 10.8822 5.6431 6.1749 5.5356 1.2867 6.0711 5.5163 4.1178 4.3455 3.1300 6.1966 6.6670 6.1125 2.5490 6.8812 11.5529 7.1724 6.7312 3.6064 4.6016 6.5713 1.2074 1.1805 1.5287 5.4815 3.7139 1.3764 1.4021 1.4184 2.6906 2.6363 2.2025 1.6181 1.4361 2.7674 1.3756 2.1551 3.2227 1.1413 1.4285 2.7459 1.3266 2.0452 1.2713 4.4123 1.0392 1.1080 1.1235 2.1525 6.5138 5.8037 6.1704 12.6177 12.6336 1.0555 1.0364 1.1081 1.0989 1.1017 1.0894 1.0901 1.0886 1.0953 1.0953
irintensity: 0.0069 2.2123 2.1338 3.9243 3.5302 5.0143 0.1884 0.8389 1.3735 0.2324 4.2165 0.6361 0.5279 1.1927 0.5715 1.5949 1.6063 8.0172 23.2398 37.2841 1.4031 0.8298 2.7660 1.5899 1.2205 1.0733 10.9508 14.1895 46.9962 1.4628 55.9140 19.1284 2.3190 3.9216 2.2203 96.6880 1.2128 7.2929 5.1768 12.1860 315.5389 26.7429 323.9938 0.0213 0.2415 3.0455 11.3354 104.2112 60.1059 1.3140 13.1611 49.2469 41.9262 84.7301 1.1894 335.9530 241.4982 14.7776 93.4882 28.0955 24.5450 26.5023 23.6406 31.6253 5.1037 8.6179 7.3435 5.2766 5.3953
temp: 298.150 k
press: 1.00000 atm
elementType: 8 7 7 6 6 6 6 6 6 6 6 6 6 6 6 1 1 1 1 1 1 1 1 1 1
symmnumber: 1
zpe: 493251.1 jmol-1
zpe.correction: 0.187869 hartree
zpe.thermalcorrener: 0.202153 hartree
zpe.thermalcorrenthalpy: 0.203097 hartree
zpe.thermalcorrgfe: 0.145482 hartree
zpe.sumelectzpe: -646.898964 hartree
zpe.sumelectthermal: -646.884681 hartree
zpe.sumelectthermalent: -646.883737 hartree
zpe.sumelectthermalfe: -646.941352 hartree
dipole: 8.5003 -1.2629 0.0107
dipole: 8.5936
quadrupole: -108.0807 -88.7272 -89.4963
quadrupole: 10.9557 0.0004 0.0480
quadrupole: -12.6460 6.7075 5.9385 10.9557 0.0004 0.0480
hfenergy: -647.0868334 hartree
pointgroup: C01 [X(C12H10N2O1)]
dipole: 3.332535 0.1454826 0.5513592 debye
dipolederiv: -2.5549209 0.341592 0.1061557 0.4390283 -0.3614796 -0.0464265 0.2149569 -0.0581598 -0.3113577 -0.5771841 0.035557 -0.0020819 0.1250969 -0.2312559 0.0194347 0.0973213 0.0086129 -0.2140526 -0.1934298 0.0033693 0.0090478 -0.1901493 -0.2745624 -0.0633076 -0.2035434 -0.0404852 -0.3058511 2.1839445 -0.2491088 -0.0299426 -0.0246215 0.1604638 0.0343771 0.2205422 0.0075037 0.1616068 -1.1900951 0.0507395 -0.0839354 0.2304242 -0.0738832 -0.0417166 0.1114573 -0.0628671 -0.0685984 -0.6773 0.1020898 0.0530754 0.4377122 -0.1286844 0.0978579 0.4257376 0.0580779 -0.0539808 -0.83511 -0.0019069 -0.0784407 -0.3599814 -0.1045919 0.0566963 -0.4782868 0.0995022 -0.1404131 0.6198234 -0.0466585 0.0387149 0.1784203 -0.0117573 0.1567613 0.2876492 0.1298838 0.0445938 0.5515541 -0.057666 0.0120391 -0.2958043 -0.0113854 0.0420202 -0.2499234 0.0698616 -0.0316888 1.0146461 -0.1819467 -0.1262983 -0.6337891 0.4657171 0.0172712 -0.6290266 0.0713549 0.3858138 1.6932297 0.0932136 0.3094718 0.1086814 0.0130598 0.0837551 0.327391 0.082392 0.0779663 -0.1627034 0.0127149 -0.0114082 0.0607476 0.0482265 0.0028775 0.0418284 -0.0028759 0.0540869 -0.7753001 -0.0203384 -0.1267352 -0.4390793 0.0937642 -0.0669139 -0.5882892 -0.0172116 0.0183491 0.7030319 -0.1085815 -0.0399209 -0.210971 -0.0115992 -0.0800237 -0.1542914 -0.0678123 -0.0549744 -0.149504 -0.0095907 -0.0353242 0.3142733 0.1635197 0.1563117 0.3208295 0.1180757 0.2230722 0.0328138 -0.0434644 -0.0651253 -0.0420059 0.1054593 -0.0784774 -0.0633039 -0.0786091 0.0763718 0.0295968 0.0515553 0.0412858 0.0768304 0.0739845 -0.0906883 0.0689071 -0.0938483 0.0674324 0.0441706 0.0773152 0.0729364 0.0412172 0.0599089 -0.0953111 0.0328791 -0.0909279 0.0530617 0.089534 -0.0215728 -0.0312401 -0.0145569 0.0873447 -0.0643295 -0.0236062 -0.0651638 0.0678898 -0.0399897 -0.0941206 0.0195267 0.0619938 -0.1442673 -0.0040149 0.1217892 0.0077878 0.0368696 -0.0220099 0.0346258 -0.0756425 0.1169759 0.0169361 0.0486867 0.0870784 0.0084324 -0.1421518 0.076097 0.0042725 -0.0023911 0.0608912 0.0519829 -0.0833386 0.0624897 -0.0902462 0.0420779 -0.0366222 0.0665532 0.0553348 0.1012857 0.0217751 -0.0958589 0.0939195 -0.099997 0.0192291 0.081996 -0.0393268 0.0031676 -0.116472 -0.0991467 0.0360713 -0.0322354 0.038261 0.0979702 0.0937314 0.000684 -0.0122695 -0.0261478 0.0904708 0.058286 -0.0922701 0.0684587 -0.1033227 unknown
polarizability: 311.5072628|-11.1810366|102.0667299|16.911879|38.7915401|110.7785233 unknown
InChI: InChI=1S/C12H10N2O/c1-2-15-12-5-3-10(4-6-12)7-11(8-13)9-14/h3-7H,2H2,1H3
charge 0 multiplicity 1
25 atoms
O  3.678393 0.137193 0.411971
N  -5.503455 0.898161 0.154657
N  -2.775372 -1.626037 -2.301683
C  2.294588 0.201602 0.317042
C  -0.546951 0.485098 0.288009
C  1.659925 1.089696 1.228261
C  1.510659 -0.543599 -0.608205
C  0.268898 1.223755 1.208212
C  0.114258 -0.400493 -0.618224
C  4.414279 -0.769051 -0.506666
C  -1.981536 0.702577 0.357841
C  5.894954 -0.624926 -0.171798
C  -3.030111 0.151184 -0.373777
C  -4.382549 0.556037 -0.089802
C  -2.879216 -0.818137 -1.423677
H  2.281187 1.652968 1.930149
H  1.979354 -1.231103 -1.317544
H  -0.212003 1.911555 1.914112
H  -0.462167 -0.984398 -1.339642
H  4.060532 -1.807318 -0.348538
H  4.202576 -0.47092 -1.552785
H  -2.297673 1.428385 1.120436
H  6.494135 -1.280957 -0.828691
H  6.229799 0.415695 -0.318562
H  6.088492 -0.909464 0.876105
