program: Gaussian 09
title: 000295571
version: EM64L-G09RevD.01
frameworkgroup: C1[X(C11H12N2O2)]
method: RPBEPBE
basis: SDD
operation: Freq
keyword: #p
keyword: freq=noraman
keyword: PBEPBE/SDD
title: #p freq=noraman PBEPBE/SDD
converged: YES YES NO NO
title: Mulliken charges:
elementType: O O N N C C C C C C C C C C C H H H H H H H H H H H H
charge: -0.215403 -0.215142 -0.188589 -0.049958 -0.393948 0.181213 0.181458 0.109250 0.107410 -0.354492 -0.354610 -0.625943 -0.626014 -0.210738 -0.210758 0.247001 0.247098 0.268581 0.268609 0.221120 0.257749 0.200246 0.199945 0.259305 0.220855 0.237862 0.237891
chargesum: 0.00000
title: Mulliken charges with hydrogens summed into heavy atoms:
elementType: O O N N C C C C C C C C C C C
charge: -0.215403 -0.215142 -0.188589 -0.049958 0.100151 0.181213 0.181458 0.109250 0.107410 -0.085911 -0.086001 0.053173 0.054091 0.027124 0.027133
polarizability: 1.87979566e+02 -1.32389167e-01 1.48682334e+02 -1.25519509e+01 -1.22384304e-01 7.66927623e+01
1716.lowfreq: -10.5256 -0.0010 -0.0007 0.0005 6.2231 11.8142 26.6619 47.5204 53.1490
frequency: 26.3024 47.5001 53.1265 89.4227 138.7746 144.5355 178.8694 182.2346 193.7514 202.2582 242.9956 308.9213 341.3078 406.7486 425.5065 429.2123 455.9725 523.9820 542.1161 606.5618 659.5792 675.7025 693.5724 720.1454 784.1330 793.2744 817.6598 824.5406 906.3478 910.2244 951.0977 974.3902 1005.9670 1012.5441 1056.9317 1064.2659 1071.9617 1088.4757 1104.0407 1134.0701 1162.7393 1170.6713 1189.1180 1267.8434 1277.3025 1283.9195 1329.1959 1366.4451 1397.2535 1415.8661 1433.0198 1434.6223 1452.6895 1453.0755 1463.9344 1470.3826 1478.4208 1483.4233 1501.8330 1614.1207 1614.2558 1623.7554 1671.3632 2877.9002 2886.0343 3004.9540 3010.6521 3011.0664 3067.9528 3081.6041 3083.7688 3138.4552 3152.0771 3163.7394 3173.7808
redmass: 3.4128 3.3757 3.1866 2.3611 5.0289 5.3327 1.1695 3.6350 2.4918 1.8751 7.1182 5.3865 6.2670 2.8463 1.7928 2.9612 4.8863 7.1054 7.6895 9.2546 4.8231 6.4572 5.5683 3.1848 5.5251 1.7161 4.2761 4.5853 1.3825 7.5665 2.9827 1.4126 1.3440 2.1037 2.0589 1.4580 2.6029 1.6559 1.8239 1.3708 1.4567 2.0177 2.0148 3.0270 4.0586 1.5604 3.1741 1.3561 1.3480 5.4585 1.1177 1.1399 2.4628 2.6954 1.1591 1.0453 1.0482 1.0504 1.0761 7.6976 9.3767 9.3800 11.6753 1.0536 1.0550 1.0604 1.0780 1.0767 1.1060 1.0993 1.0992 1.0863 1.0905 1.0955 1.1004
irintensity: 0.0823 4.0012 0.3271 1.4089 0.0102 5.9709 0.6767 1.6092 2.1240 5.7833 0.8940 16.9615 4.9994 1.6302 1.5164 4.3466 0.0024 8.5292 11.5041 39.0563 0.0019 0.3573 15.4529 63.3054 0.0010 46.4886 7.1051 1.0835 0.0065 16.3608 78.1596 2.4369 0.0007 8.4935 221.8439 11.5809 16.9661 11.1982 0.4351 3.6009 0.6804 4.2443 10.3485 35.3184 483.6875 3.4621 11.1054 2.2055 11.9432 8.5884 41.1489 13.5836 10.3665 0.2666 13.4966 1.6178 17.1795 28.7931 5.6636 3.0143 269.9495 183.7826 63.2714 71.4582 262.0611 73.9589 15.7485 33.0299 0.6567 8.7753 24.3202 1.7717 5.5108 6.7155 21.9445
temp: 298.150 k
press: 1.00000 atm
elementType: 8 8 7 7 6 6 6 6 6 6 6 6 6 6 6 1 1 1 1 1 1 1 1 1 1 1 1
symmnumber: 1
zpe: 556241.2 jmol-1
zpe.correction: 0.211861 hartree
zpe.thermalcorrener: 0.225983 hartree
zpe.thermalcorrenthalpy: 0.226928 hartree
zpe.thermalcorrgfe: 0.169528 hartree
zpe.sumelectzpe: -685.243215 hartree
zpe.sumelectthermal: -685.229093 hartree
zpe.sumelectthermalent: -685.228149 hartree
zpe.sumelectthermalfe: -685.285548 hartree
dipole: -1.6381 -0.0149 0.6160
dipole: 1.7501
quadrupole: -65.6673 -96.7356 -88.1909
quadrupole: 0.1198 -2.6301 0.0186
quadrupole: 17.8640 -13.2044 -4.6596 0.1198 -2.6301 0.0186
hfenergy: -685.4550762 hartree
pointgroup: C01 [X(C11H12N2O2)]
dipole: 0.6354627 0.1763378 0.1979905 debye
polarizability: 187.0545575|9.7185667|139.6050446|11.0169113|-24.6276893|86.6950599 unknown
InChI: InChI=1S/C11H12N2O2/c1-12(2)7-13-10(14)8-5-3-4-6-9(8)11(13)15/h3-6H,7H2,1-2H3
charge 0 multiplicity 1
27 atoms
O  -0.777602 1.881569 -1.317925
O  -0.169129 -2.41973 0.502669
N  -0.798477 -0.35498 -0.501997
N  -3.071584 -0.246512 0.448973
C  -2.258562 -0.636292 -0.681485
C  1.241074 0.765187 -0.369896
C  1.424241 -0.528793 0.177086
C  -0.190494 0.897316 -0.79984
C  0.114613 -1.258397 0.11213
C  2.297428 1.685219 -0.442127
C  2.669905 -0.945901 0.668916
C  -3.579807 -1.30169 1.334149
C  -3.898026 0.960709 0.324146
C  3.56242 1.273208 0.05346
C  3.745815 -0.022253 0.600447
H  -2.324542 -1.723262 -0.870153
H  -2.55213 -0.0891 -1.595717
H  2.143785 2.682708 -0.865649
H  2.799401 -1.948138 1.089283
H  -3.776232 -0.886671 2.341016
H  -2.821993 -2.096607 1.441848
H  -4.528355 -1.765702 0.969822
H  -4.884808 0.772246 -0.164057
H  -3.357666 1.723537 -0.26208
H  -4.096801 1.385863 1.32632
H  4.410925 1.964797 0.014648
H  4.733301 -0.311829 0.975615
