program: Gaussian 09
title: 000295588
version: EM64L-G09RevD.01
frameworkgroup: C1[X(C16H12BrClN2O2S)]
method: RPBEPBE
basis: SDD
operation: Freq
keyword: #p
keyword: freq=noraman
keyword: PBEPBE/SDD
title: #p freq=noraman PBEPBE/SDD
converged: YES YES NO NO
title: Mulliken charges:
elementType: Br Cl S O O N N C C C C C C C C C C C C C C C C H H H H H H H H H H H H
charge: 0.044660 -0.001575 0.208061 -0.208801 -0.175913 -0.340420 -0.699457 -0.583174 -0.499503 0.269811 0.158036 0.649411 -0.366774 -0.292121 -0.308756 0.511564 -0.232712 -0.170961 -0.182938 -0.223781 -0.395494 -0.268257 -0.198069 0.345662 0.292266 0.271003 0.258314 0.246390 0.280361 0.259896 0.217937 0.230045 0.223990 0.300913 0.380385
chargesum: 0.00000
title: Mulliken charges with hydrogens summed into heavy atoms:
elementType: Br Cl S O O N N C C C C C C C C C C C C C C C C
charge: 0.044660 -0.001575 0.208061 -0.208801 -0.175913 -0.340420 -0.018158 -0.237512 0.063765 0.269811 0.158036 0.649411 -0.366774 -0.292121 -0.050442 0.511564 0.013679 0.109400 0.076958 -0.223781 -0.177557 -0.038212 0.025921
polarizability: 3.89519215e+02 -3.60015209e+00 1.94809018e+02 -9.39156645e+00 2.33713223e+00 1.59563397e+02
1716.lowfreq: -5.0006 -2.6318 -0.0016 -0.0008 0.0007 2.9159 12.8524 22.0550 25.3355
frequency: 12.5856 22.0010 25.3137 44.7773 57.2562 58.8073 83.4096 113.7038 140.0199 145.9934 158.5514 163.2131 171.5516 202.5611 239.5464 253.5158 270.4459 286.3001 333.4395 344.6811 374.3202 396.2534 430.6472 442.1393 446.0180 461.1489 471.8587 498.8700 530.2880 538.1640 543.3813 554.2844 570.7851 592.8449 616.2203 632.2886 658.6412 659.2083 683.5864 713.4798 725.5952 739.6484 753.3100 758.6947 819.2319 830.4221 843.9313 874.8574 911.1545 938.0671 947.6657 953.8326 971.1569 1000.7205 1013.8881 1035.1740 1036.7926 1043.2971 1049.6079 1071.9016 1133.7541 1137.6531 1141.5465 1151.5599 1170.1343 1171.6414 1190.3167 1237.9175 1251.1923 1264.3824 1274.6303 1327.7061 1343.6625 1358.3858 1376.8313 1383.8577 1435.1323 1439.9201 1463.6835 1484.8392 1562.8043 1567.4613 1589.7089 1610.9198 1631.5708 1661.0139 1698.4035 3029.2893 3077.3732 3090.1885 3116.7835 3136.3682 3144.5734 3163.1526 3169.3204 3183.3966 3185.8623 3438.7531 3645.0498
redmass: 9.4252 9.3023 7.0842 7.2822 7.4416 5.3986 5.3691 11.0463 8.6296 11.2098 5.9386 8.9876 6.5746 8.4600 4.5938 7.4871 4.6482 7.2144 11.8643 6.6338 6.9246 8.8795 1.6686 1.7357 3.3505 3.6935 4.1167 7.4300 4.6435 4.2372 5.9401 4.5957 3.5916 4.7284 2.9112 1.6358 6.9893 6.5361 5.5799 4.0411 3.0835 5.6348 1.4117 5.9755 1.4402 4.9224 1.5396 1.4184 7.3968 1.3726 2.0691 1.3924 1.3193 3.5790 4.3873 2.3693 3.7595 2.2015 2.2715 2.5590 1.8073 1.4305 1.3136 2.1468 1.4255 1.4580 1.5888 1.4718 1.3340 1.5895 1.4968 1.9536 4.1904 5.5979 5.1707 6.2704 1.0927 2.5332 3.0134 3.2653 6.2749 8.6076 7.4914 5.8911 7.7194 1.2591 11.8952 1.0614 1.0904 1.0979 1.0869 1.0881 1.0944 1.0896 1.1001 1.0941 1.0967 1.0567 1.0940
irintensity: 0.1608 0.0890 0.0682 0.1512 0.4383 3.0110 3.1773 2.0670 2.4927 0.0739 0.4504 1.6052 1.4171 3.7074 3.6159 1.3000 3.0189 2.0656 17.9683 0.4184 3.8176 21.0029 48.0146 30.7309 7.4407 12.0014 12.9998 5.6410 6.3543 3.7077 10.1092 3.5203 5.7981 10.7864 42.8687 171.1551 14.0020 7.3930 22.6881 8.2742 6.3360 22.1100 93.2286 33.7306 18.6598 5.9009 4.2167 16.1634 67.2446 0.8447 6.4293 1.3826 0.4190 5.9175 4.1346 1.5495 19.2680 4.1747 29.9865 44.4562 131.2698 5.3039 28.3063 123.1104 27.9834 23.3605 49.4765 8.1069 8.6629 9.5992 0.5504 15.6922 214.4632 13.2902 27.4996 29.7480 25.2541 3.5678 265.3642 70.4707 6.1516 20.1931 25.8396 60.4888 387.3537 214.0919 70.9040 6.6163 0.9656 0.5603 9.4076 3.7225 27.0180 2.1328 28.2196 0.1117 1.5556 306.4125 67.6850
temp: 298.150 k
press: 1.00000 atm
elementType: 35 17 16 8 8 7 7 6 6 6 6 6 6 6 6 6 6 6 6 6 6 6 6 1 1 1 1 1 1 1 1 1 1 1 1
symmnumber: 1
zpe: 644199.8 jmol-1
zpe.correction: 0.245363 hartree
zpe.thermalcorrener: 0.266687 hartree
zpe.thermalcorrenthalpy: 0.267631 hartree
zpe.thermalcorrgfe: 0.191012 hartree
zpe.sumelectzpe: -1746.842487 hartree
zpe.sumelectthermal: -1746.821163 hartree
zpe.sumelectthermalent: -1746.820219 hartree
zpe.sumelectthermalfe: -1746.896838 hartree
dipole: -1.1118 -0.2132 -3.0159
dipole: 3.2214
quadrupole: -149.0749 -158.3864 -152.1133
quadrupole: -3.7912 5.0270 -0.0521
quadrupole: 4.1166 -5.1949 1.0782 -3.7912 5.0270 -0.0521
hfenergy: -1747.0878501 hartree
pointgroup: C01 [X(C16H12Br1Cl1N2O2S1)]
dipole: 0.3845401 0.1255624 -1.2011026 debye
polarizability: 387.8436289|-20.0347861|196.9533774|-3.321727|0.3418806|159.0946233 unknown
InChI: InChI=1S/C16H12BrClN2O2S/c17-9-5-6-12(10(18)7-9)20-15(21)8-14(16(20)22)23-13-4-2-1-3-11(13)19/h1-7,14H,8,19H2
charge 0 multiplicity 1
35 atoms
Br -7.121772 1.548011 0.462126
Cl -1.971263 0.596386 2.61676
S  2.162532 -0.557372 1.231481
O  -0.222112 1.232621 -0.224292
O  -2.003187 -3.112607 -0.076384
N  -1.407622 -0.813639 -0.075196
N  2.6659 2.104711 -0.38142
C  0.969532 -0.960728 -0.236186
C  0.387003 -2.386954 -0.195124
C  -0.234205 -0.020482 -0.183202
C  -1.131493 -2.221182 -0.111332
C  -2.728132 -0.268939 0.058924
C  3.684286 -0.0261 0.345342
C  -3.120688 0.425742 1.22785
C  -3.669483 -0.440152 -0.980713
C  3.757515 1.258671 -0.292351
C  4.81539 -0.874318 0.395001
C  -4.41158 0.973651 1.355988
C  -4.973039 0.085173 -0.871983
C  -5.32336 0.795331 0.295468
C  5.017059 1.642299 -0.856123
C  6.04823 -0.47569 -0.162786
C  6.135149 0.794357 -0.787202
H  1.566437 -0.750079 -1.137484
H  0.731886 -2.960614 0.682018
H  0.642071 -2.980216 -1.090171
H  -3.374154 -0.991491 -1.878142
H  4.717911 -1.84763 0.888105
H  -4.69383 1.511952 2.263676
H  -5.694981 -0.052512 -1.68055
H  5.099172 2.6211 -1.344927
H  6.919103 -1.13594 -0.110012
H  7.084309 1.123737 -1.225706
H  2.769296 3.010243 -0.832477
H  1.729821 1.838162 -0.058382
