program: Gaussian 09
title: 000295568
version: EM64L-G09RevD.01
frameworkgroup: C1[X(C9H13O2P)]
method: RPBEPBE
basis: SDD
operation: Freq
keyword: #p
keyword: freq=noraman
keyword: PBEPBE/SDD
title: #p freq=noraman PBEPBE/SDD
converged: YES YES NO NO
title: Mulliken charges:
elementType: P O O C C C C C C C C C H H H H H H H H H H H H H
charge: 0.943558 -0.530660 -0.547359 -0.326901 0.441051 -0.261607 -0.218663 -0.398449 -0.357891 -0.805191 -0.495255 -0.492481 0.244627 0.287907 0.233532 0.230805 0.228174 0.224735 0.236394 0.232030 0.227020 0.229609 0.224169 0.217582 0.233266
chargesum: 0.00000
title: Mulliken charges with hydrogens summed into heavy atoms:
elementType: P O O C C C C C C C C C
charge: 0.943558 -0.530660 -0.547359 -0.326901 0.441051 -0.016980 0.069244 -0.164917 -0.127086 -0.115888 0.193403 0.182535
polarizability: 1.76105595e+02 -2.31040511e+00 1.19513630e+02 -2.88318063e+00 -1.05026190e+01 8.77970785e+01
1716.lowfreq: -17.6091 -8.1676 -0.0010 0.0012 0.0014 7.2386 23.2024 33.0065 54.6292
frequency: 21.9008 32.8646 54.3135 72.7988 78.5698 87.9656 111.4895 128.4348 159.0388 221.4740 266.9386 276.7612 297.7626 362.0872 381.5236 398.5564 441.9305 516.4145 585.8825 602.1870 606.5898 635.1837 719.0956 788.9512 818.4365 858.5412 952.5667 957.1619 985.3717 987.5078 988.2820 1009.9463 1047.6418 1080.3737 1103.8479 1112.8308 1120.6926 1124.7093 1131.7230 1194.9484 1221.6140 1302.6443 1360.9019 1396.1582 1397.9529 1418.9622 1429.7378 1452.3225 1460.2312 1469.8101 1470.3223 1473.8338 1474.7087 1486.9031 1572.5018 1609.5531 2959.3900 2968.6574 2977.0964 3050.0655 3057.0297 3063.5565 3086.3544 3100.1165 3107.1781 3112.6156 3119.0101 3137.0871 3162.4640
redmass: 3.1953 1.0565 2.2188 1.9914 1.5999 1.1750 3.6679 3.3790 3.5770 4.2602 4.3276 4.6741 4.5797 3.2799 5.0470 2.8900 4.8402 3.3976 10.0528 8.1731 6.2889 7.1946 3.5292 4.9191 1.3594 1.2495 11.0261 1.3135 1.4174 1.4797 6.1213 3.7376 1.5717 3.2374 1.2553 1.2539 1.3339 1.3152 1.3239 1.1214 2.9042 1.2888 4.3190 3.3919 1.2344 1.1227 1.1203 1.0530 1.0529 1.0575 1.0711 1.0705 1.0545 2.3799 5.8827 6.1247 1.0311 1.0299 1.0379 1.1038 1.0961 1.1038 1.0993 1.1012 1.1025 1.0873 1.0898 1.0965 1.0943
irintensity: 0.1335 0.6142 0.8319 0.1774 2.4278 0.0594 1.4599 9.8327 6.1180 11.3960 1.7014 5.3753 3.4054 4.6597 2.6748 0.1096 18.6879 29.9417 84.5018 47.1392 20.7924 5.0079 3.7484 2.1640 45.9121 2.1697 110.7037 1.9114 8.0138 8.6047 163.4428 2.5850 17.4121 22.6450 0.1148 0.4853 8.2938 1.2538 2.8100 6.6279 0.7644 3.8370 0.5955 4.8225 12.7859 2.2866 1.1100 8.9879 14.8437 11.7492 9.8946 13.2019 14.0507 16.4760 0.1448 14.0814 103.0082 45.0991 33.7911 44.6337 21.5102 40.7232 18.4648 23.3377 25.0910 5.6569 20.6224 21.5227 6.0687
temp: 298.150 k
press: 1.00000 atm
elementType: 15 8 8 6 6 6 6 6 6 6 6 6 1 1 1 1 1 1 1 1 1 1 1 1 1
symmnumber: 1
zpe: 521703.9 jmol-1
zpe.correction: 0.198707 hartree
zpe.thermalcorrener: 0.213297 hartree
zpe.thermalcorrenthalpy: 0.214241 hartree
zpe.thermalcorrgfe: 0.154733 hartree
zpe.sumelectzpe: -841.506396 hartree
zpe.sumelectthermal: -841.491806 hartree
zpe.sumelectthermalent: -841.490861 hartree
zpe.sumelectthermalfe: -841.550370 hartree
dipole: -1.2387 -0.9018 1.1456
dipole: 1.9132
quadrupole: -67.4239 -77.3376 -78.9870
quadrupole: -5.8763 1.3932 -0.1178
quadrupole: 7.1590 -2.7548 -4.4042 -5.8763 1.3932 -0.1178
hfenergy: -841.7051025 hartree
pointgroup: C01 [X(C9H13O2P1)]
dipole: -0.47111 -0.1471033 0.5683079 debye
dipolederiv: 1.1739631 0.0206167 -0.0155776 -0.1272887 1.2229389 0.1614173 0.2286265 -0.0752229 0.7578913 -0.6355268 0.0690447 0.0715038 -0.1202154 -0.966733 -0.1752777 -0.1404728 -0.4679243 -0.6504326 -1.119216 0.3291426 -0.154347 0.3864263 -0.710093 0.026027 -0.4969562 0.3720101 -0.5929241 -0.2929705 -0.0224208 0.0341194 0.105086 -0.2228906 -0.0807688 0.1802196 0.0148931 -0.2241801 0.4484754 0.0236802 -0.0952958 0.0778583 -0.011295 -0.0282554 -0.0908945 -0.0102802 0.0143808 -0.0252282 0.0287542 -0.070748 -0.0883185 -0.0419549 -0.0893992 0.1198517 -0.0872486 0.0101973 -0.1103736 -0.0682493 0.0553958 0.0503574 -0.046205 -0.0477156 -0.0777931 -0.06221 -0.0157232 -0.1585178 -0.0908083 0.0989444 -0.1399464 -0.0925846 -0.0783653 0.1401879 -0.086143 -0.07196 -0.247043 0.0277931 -0.0565401 0.0436077 -0.0645796 -0.1330244 -0.0833083 -0.1398878 0.0151771 -0.1654224 -0.024237 0.0533393 -0.1255278 0.0645817 0.013546 0.0608995 -0.0053304 0.0618167 0.2839546 -0.163226 -0.0479842 -0.0173253 0.2997162 0.0441978 0.1333432 0.3149925 0.3974467 0.8779047 -0.334696 0.1667986 -0.1778052 0.3589156 -0.0121638 0.0188724 0.0398411 0.2331039 0.087071 -0.0342649 0.0795795 -0.018784 0.0727094 0.0883679 0.0543839 0.0907978 0.0120504 0.116902 0.0618141 -0.048397 0.0611499 0.0982633 0.0513499 -0.0411399 0.0579725 0.0698959 -0.0472114 0.0818529 -0.0730874 0.0899094 0.0717436 0.090193 -0.0641936 0.0822043 0.0554059 0.0225042 -0.0405354 0.0708036 -0.0407592 0.0628483 0.1108571 0.0863573 0.1183197 -0.0150916 0.029322 0.0039753 0.0060934 0.0332439 0.108762 -0.0088956 0.0925281 -0.0245168 -0.1335134 0.0063556 0.0485127 -0.0122763 0.141426 -0.0281349 0.074888 -0.0762747 0.1051632 0.0426051 -0.0437358 -0.0647749 -0.0004544 -0.1119786 -0.0700854 -0.0571505 -0.027375 -0.0569087 0.0938624 0.0729355 -0.0724822 0.0094446 -0.1003995 -0.1613636 -0.0348647 0.0034806 -0.0560591 0.0638975 0.042219 0.0421694 -0.0600716 0.0732331 0.0330206 0.0981027 -0.071547 -0.0284599 -0.1081159 -0.1396413 0.0782229 0.0601824 0.0216156 0.079666 -0.0125663 0.0011492 -0.0433568 0.0161707 -0.1405755 -0.0240678 -0.0530724 -0.1513174 -0.0697454 -0.0379859 -0.0016425 -0.0242414 0.0827617 -0.0459708 0.0766735 0.0054838 0.0617959 0.0090283 -0.0829613 0.1271036 -0.166553 -0.0734291 0.009826 0.0475104 -0.0238366 0.0739566 0.003471 0.1204477 -0.0754061 0.1381485 -0.0412933 unknown
polarizability: 176.0297787|-3.0997441|106.5115232|-3.5091714|-18.736701|100.8750023 unknown
InChI: InChI=1S/C9H13O2P/c1-8-4-6-9(7-5-8)12(10-2)11-3/h4-7H,1-3H3
charge 0 multiplicity 1
25 atoms
P  1.835454 -0.107476 -1.093183
O  2.266686 1.582255 -0.760759
O  2.394734 -0.966425 0.373173
C  0.024155 -0.134304 -0.569967
C  -2.76086 -0.150728 0.072447
C  -0.895408 0.618987 -1.341499
C  -0.452808 -0.900129 0.520888
C  -2.270531 0.613004 -1.01805
C  -1.828566 -0.90249 0.835734
C  -4.242321 -0.181422 0.405352
C  1.849232 2.231605 0.498423
C  3.810792 -1.366119 0.398013
H  -0.542154 1.220553 -2.188601
H  0.261945 -1.474367 1.118055
H  -2.969645 1.206112 -1.619985
H  -2.185371 -1.496357 1.686825
H  -4.414045 -0.082544 1.492621
H  -4.78973 0.63131 -0.102412
H  -4.700315 -1.138815 0.089902
H  2.239708 3.259996 0.440887
H  2.282804 1.709682 1.371628
H  0.747019 2.250458 0.595432
H  4.472462 -0.487638 0.520114
H  4.099294 -1.913471 -0.52088
H  3.918071 -2.031077 1.270143
