program: Gaussian 09
title: 000295565
version: EM64L-G09RevD.01
frameworkgroup: C1[X(C9H11NO3)]
method: RPBEPBE
basis: SDD
operation: Freq
keyword: #p
keyword: freq=noraman
keyword: PBEPBE/SDD
title: #p freq=noraman PBEPBE/SDD
converged: YES YES NO NO
title: Mulliken charges:
elementType: O O O N C C C C C C C C C H H H H H H H H H H H
charge: -0.437836 -0.451818 -0.266722 -0.416337 0.457641 -0.410674 -0.375106 -0.422693 -0.283536 0.256566 -0.368260 -0.306923 0.100517 0.240167 0.217895 0.295165 0.268884 0.218696 0.220870 0.187543 0.268507 0.271438 0.357158 0.378860
chargesum: 0.00000
title: Mulliken charges with hydrogens summed into heavy atoms:
elementType: O O O N C C C C C C C C C
charge: -0.080678 -0.072958 -0.266722 -0.121172 0.457641 0.047388 -0.106223 -0.203997 0.124876 0.256566 -0.099753 -0.035485 0.100517
polarizability: 2.02540375e+02 -1.37667466e+01 1.10756389e+02 9.74644044e+00 1.05396284e+01 6.26098578e+01
1716.lowfreq: -12.7491 -6.4622 -0.0006 -0.0006 -0.0005 7.2444 36.7574 46.6083 85.5520
frequency: 36.5305 46.4876 85.5369 93.0005 109.0463 155.0045 232.4452 261.3689 302.0377 340.9727 377.9711 419.6137 427.5528 474.0516 489.1060 506.4287 532.6979 566.7348 580.5139 630.3175 683.6391 694.5682 753.1451 788.9202 824.0008 843.3241 848.8918 896.4138 973.5834 983.3248 988.6274 1004.4977 1015.5763 1064.2488 1095.0083 1132.4838 1152.2992 1175.5201 1201.8990 1244.4073 1294.7276 1315.1728 1322.6523 1328.8928 1353.9577 1371.0930 1383.8482 1442.2047 1458.8620 1461.8921 1482.0026 1527.7139 1575.2808 1628.2434 1641.6466 2956.0710 2992.2914 3061.1194 3073.4286 3116.0656 3147.4333 3168.0082 3174.3699 3534.6195 3554.4951 3557.3566
redmass: 4.5776 6.3623 5.1469 4.2928 4.3314 5.6828 4.5305 4.2985 4.0092 2.1732 1.4396 2.6382 4.8832 1.1611 3.5328 2.9452 2.2483 4.5746 1.2083 6.9531 3.6136 4.3616 4.6788 4.2329 1.3308 1.8082 2.8859 1.7019 1.3556 1.4289 3.8814 3.2021 2.7471 2.0882 2.7960 1.3452 1.5601 1.3060 1.1913 1.2085 1.6691 1.6506 2.5705 1.2392 1.3062 1.5183 2.3005 3.3667 1.1053 1.1863 1.7293 3.0723 4.5121 6.4577 7.9949 1.0680 1.0625 1.0990 1.0979 1.0899 1.0881 1.0957 1.0951 1.0641 1.0662 1.0765
irintensity: 0.9327 0.8234 2.1144 1.2914 0.0460 1.4445 0.9016 1.1227 19.2174 31.5013 156.4111 24.8513 9.2140 189.2858 15.8563 7.3353 3.3564 59.3960 96.3720 3.8801 61.9256 0.2316 23.6290 0.8311 16.6463 37.1144 24.5585 4.9673 1.4245 15.5300 127.1456 67.2343 193.6492 23.3316 9.5432 12.8494 223.3713 18.9842 11.0546 21.8809 47.3207 14.6644 157.5054 3.9903 15.0980 42.6705 87.3052 5.7315 5.7950 14.9569 0.4089 157.4935 39.0278 596.4687 186.8705 75.7188 66.1236 24.5279 46.6283 18.3282 1.1171 6.5912 2.3797 49.0977 2.5091 42.9002
temp: 298.150 k
press: 1.00000 atm
elementType: 8 8 8 7 6 6 6 6 6 6 6 6 6 1 1 1 1 1 1 1 1 1 1 1
symmnumber: 1
zpe: 496182.6 jmol-1
zpe.correction: 0.188986 hartree
zpe.thermalcorrener: 0.201562 hartree
zpe.thermalcorrenthalpy: 0.202506 hartree
zpe.thermalcorrgfe: 0.148987 hartree
zpe.sumelectzpe: -629.016046 hartree
zpe.sumelectthermal: -629.003470 hartree
zpe.sumelectthermalent: -629.002526 hartree
zpe.sumelectthermalfe: -629.056045 hartree
dipole: -3.9861 4.4263 -0.1774
dipole: 5.9592
quadrupole: -67.2795 -79.0565 -77.9205
quadrupole: -3.5898 6.6103 2.8126
quadrupole: 7.4726 -4.3043 -3.1683 -3.5898 6.6103 2.8126
hfenergy: -629.2050315 hartree
pointgroup: C01 [X(C9H11N1O3)]
dipole: 1.5360449 -1.1513839 -1.3460079 debye
dipolederiv: -0.5877054 0.1473166 0.0625406 0.2076693 -0.2673702 0.0948363 -0.1051535 0.0480488 -0.765863 -1.0619257 -0.4555536 -0.0894496 -0.7273238 -0.7767993 -0.0047916 -0.2156984 -0.0628919 -0.4161455 -1.0183611 0.2234708 0.2651974 0.392465 -0.7912894 -0.3114579 0.3602612 -0.2799215 -0.5648495 -1.8262382 -0.010753 0.1708696 0.1422145 -0.2233083 0.0792274 0.226508 0.1072901 -0.5297335 1.7994178 -0.0663786 -0.3504593 -0.3028428 0.0733347 0.0463531 -0.5166754 0.013356 0.2368078 0.604492 0.1462021 -0.0394261 0.5034347 0.2578786 -0.0841599 0.0602489 0.0213331 0.158933 -0.5244043 0.0406882 0.0861463 0.5616362 -0.1099971 -0.0332841 0.3172084 0.0515024 -0.2692907 -0.7369501 0.0415535 0.1120089 -0.3878481 0.0075291 0.2048951 -0.0443095 0.1071448 -0.1622194 0.4089892 -0.0797702 -0.1225651 -0.177509 0.3028846 0.0132236 -0.0675963 -0.009759 0.4983589 -1.2420622 0.021569 0.2732559 0.0449 -0.2236712 -0.1022014 0.3185729 -0.0962178 -0.1622266 0.6179876 0.067562 -0.1234341 0.2098583 0.0712692 0.0331442 -0.0782003 0.070648 -0.0462567 0.4445027 -0.0679238 -0.1522371 -0.2335592 0.1035832 0.1449497 -0.2472734 0.1137173 0.0252941 2.4606489 0.1029745 -0.4569568 0.1056713 1.1348157 0.4285116 -0.4834857 0.4355555 0.5532081 0.0107817 0.0980494 -0.0546602 -0.0277841 -0.0799279 0.0435402 -0.0393764 -0.0226505 0.0891575 -0.1213538 -0.0378185 0.1026714 -0.0347372 0.0923289 -0.0569756 0.136966 -0.0151128 -0.1141096 0.1360726 -0.0532325 0.0350139 -0.1316288 0.1154255 -0.059458 0.0253506 -0.0591862 0.2854722 0.0210418 -0.0803798 -0.00003 -0.0996064 0.0416276 -0.0494186 0.0010173 -0.043308 0.1412509 0.0287275 0.0711801 0.0713882 0.0458258 -0.0274747 -0.1117294 0.0629819 -0.1175411 0.0860136 -0.1116208 -0.0973142 0.0387659 -0.1836009 -0.0199153 0.0204275 -0.0363693 -0.0022137 0.0572102 -0.0011797 0.0903291 0.0180105 0.19973 -0.1527489 -0.0141035 0.0378575 -0.0143642 -0.0243942 0.1103359 0.0386234 0.0270549 0.0106005 0.0289128 -0.0639861 0.0204919 -0.0728726 0.1079248 0.0704952 -0.0751169 -0.0189033 -0.0671423 0.0419835 -0.0408691 -0.0198956 -0.03652 0.1398325 0.2576364 -0.128337 0.0795974 -0.2037459 0.114085 -0.0861043 0.1778981 -0.0660406 0.3417347 0.260672 0.0630594 0.0656009 0.1533229 0.286844 -0.0905695 0.108671 -0.0699964 0.3338905 unknown
polarizability: 198.8769404|4.2455844|99.6249707|-28.012321|21.5253826|77.404711 unknown
InChI: InChI=1S/C9H11NO3/c11-6-5-10-8-3-1-7(2-4-8)9(12)13/h1-4,10-12H,5-6H2
charge 0 multiplicity 1
24 atoms
O  3.508053 0.693722 1.510652
O  -3.993995 -0.94516 0.295578
O  -3.621711 1.137564 1.25682
N  2.280644 -0.510073 -1.024736
C  0.961517 -0.332522 -0.601439
C  3.346784 0.50128 -0.982218
C  0.530353 0.834437 0.105892
C  0.000347 -1.354829 -0.885253
C  4.241007 0.40798 0.274918
C  -1.764165 -0.050611 0.207083
C  -0.8123 0.964973 0.491769
C  -1.334333 -1.216694 -0.485255
C  -3.159374 0.141248 0.642282
H  2.896776 1.508888 -1.036258
H  3.983754 0.381718 -1.880819
H  2.488276 -1.383267 -1.510153
H  1.244411 1.620833 0.365497
H  0.316881 -2.254043 -1.429144
H  5.029312 1.179061 0.226859
H  4.72519 -0.591634 0.318913
H  -1.148048 1.855601 1.033833
H  -2.06289 -2.001479 -0.707297
H  2.785708 0.023571 1.621143
H  -4.911699 -0.741466 0.619338
