program: Gaussian 09
title: 000295598
version: EM64L-G09RevD.01
frameworkgroup: C1[X(C16H19NO4S2)]
method: RPBEPBE
basis: SDD
operation: Freq
keyword: #p
keyword: freq=noraman
keyword: PBEPBE/SDD
title: #p freq=noraman PBEPBE/SDD
converged: YES YES NO NO
title: Mulliken charges:
elementType: S S O O O O N C C C C C C C C C C C C C C C C H H H H H H H H H H H H H H H H H H H
charge: 0.294439 0.098734 -0.306759 -0.301694 -0.247031 -0.227967 -0.078974 -0.556422 -0.397557 0.557805 -0.577219 0.318655 -0.368400 -0.516150 0.229413 -0.257779 -0.357225 0.173505 -0.070641 -0.231332 -0.530212 -0.530189 -0.664991 0.252730 0.226049 0.249560 0.254006 0.261364 0.243607 0.249953 0.264277 0.225629 0.221815 0.228372 0.224503 0.250157 0.221868 0.254365 0.226855 0.215336 0.238522 0.239023
chargesum: 0.00000
title: Mulliken charges with hydrogens summed into heavy atoms:
elementType: S S O O O O N C C C C C C C C C C C C C C C C
charge: 0.294439 0.098734 -0.306759 -0.301694 -0.247031 -0.227967 -0.078974 -0.077643 0.106010 0.557805 -0.315855 0.318655 -0.124793 -0.516150 0.229413 -0.257779 -0.107272 0.173505 0.193635 0.216112 0.172820 0.172900 0.027890
polarizability: 2.14958846e+02 -2.67616868e+01 2.88766674e+02 -1.37871038e-01 -2.21588091e+01 2.15168444e+02
1716.lowfreq: -15.6716 -6.9972 -5.6740 -3.0557 -0.0014 0.0013 0.0022 8.1706 16.4248
frequency: -13.2386 -3.1193 15.7672 22.3023 50.1897 58.9388 64.6654 80.5346 97.4470 106.2246 111.2834 122.1313 149.8363 162.9278 175.0537 190.7627 212.6477 225.4144 236.0795 246.1921 249.3364 268.4756 274.1828 293.7538 325.7341 346.6169 367.3112 396.3698 406.6195 421.7130 424.8033 445.2758 482.7299 495.8440 523.3714 529.8030 566.5381 574.7746 627.1839 637.3343 684.0150 708.8209 711.2785 726.0202 747.6896 807.1577 809.9381 823.5837 851.7726 857.2957 866.1691 896.5444 933.3479 946.0327 950.1301 961.6159 975.1771 1000.4627 1026.0377 1046.0357 1093.0560 1098.9421 1113.7467 1115.8953 1130.2506 1138.5748 1143.7579 1153.6598 1157.7148 1163.9294 1195.4271 1201.3874 1229.2206 1245.6087 1258.9744 1268.1195 1292.4941 1299.9182 1315.7770 1348.0605 1364.8140 1370.0684 1382.4494 1402.2440 1403.9809 1423.5719 1442.8847 1454.2921 1457.4563 1459.4676 1460.5106 1467.6507 1472.3612 1477.9697 1484.7649 1487.0646 1488.3309 1575.3876 1610.2527 1614.4703 1652.8806 2970.3959 2972.1147 2979.3474 2982.3765 3002.4587 3018.4586 3047.9870 3056.8199 3066.7729 3068.3568 3088.0563 3099.9326 3105.7296 3113.6334 3118.8002 3119.0480 3140.3556 3143.6387 3164.0254
redmass: 2.1432 4.6002 6.4551 4.4617 5.1548 5.1028 4.6053 6.1057 4.8068 2.9282 4.7770 4.0597 3.0072 1.1644 1.2445 3.2968 4.6016 3.5054 1.5661 3.3903 4.6961 6.2614 3.5730 4.2775 3.1872 4.1195 4.7881 8.4636 6.4736 4.0773 4.3346 4.0968 5.1810 3.6621 17.3151 7.0116 4.6012 4.3344 3.5461 5.2321 4.2224 6.9307 6.0156 6.1580 3.4114 1.1920 2.1010 1.8838 2.6341 4.5394 1.4735 1.6918 3.3774 2.8983 2.4614 2.6952 4.0137 2.5758 2.7579 2.5513 3.0701 3.0433 1.2421 1.2416 1.4599 3.5347 1.5092 1.3756 1.5172 2.8320 1.8325 1.6140 2.1784 2.4275 1.1456 2.2002 2.3010 1.3593 2.4206 1.5408 1.3314 4.2994 1.6089 1.2544 1.9727 1.1722 1.3440 1.1317 1.0547 1.0648 1.0390 1.1436 1.0710 1.0667 1.0678 1.9758 1.2552 6.8392 11.1736 6.7676 7.2742 1.0307 1.0309 1.0654 1.0556 1.0367 1.0596 1.1087 1.0963 1.1038 1.1039 1.1031 1.0988 1.0916 1.1021 1.1027 1.1027 1.0879 1.0918 1.0965
irintensity: 0.3826 0.1281 0.1222 2.2330 2.1478 0.7811 1.4844 2.8710 3.9996 4.3024 1.1505 2.4770 1.7664 0.7044 0.2853 7.9684 0.6164 7.2065 2.6329 5.6889 0.9993 5.3131 5.0607 3.6228 3.5160 1.5892 3.5912 8.5440 8.9968 5.6714 7.2752 4.2400 29.7836 6.6249 2.7570 1.2834 6.9662 15.4193 5.6078 21.9772 11.8715 23.6099 0.3204 6.1388 4.3624 4.6160 0.3848 19.4005 68.4429 17.2314 12.3247 62.0931 18.7657 34.4638 26.0747 9.1735 27.4731 6.5813 124.9178 45.3811 53.4409 185.4606 12.7341 3.2258 11.5844 30.1457 18.3415 42.9205 6.2564 619.8079 77.6981 50.4048 52.7943 94.7314 0.2283 42.1292 58.3111 1.7528 91.6671 56.1659 60.8382 8.2428 50.0965 52.8509 12.3635 0.3930 16.4012 57.5614 13.9042 6.7717 12.9140 11.0735 18.3183 6.6097 9.3481 52.4621 88.1192 7.2376 217.9524 1.9230 370.1708 91.3892 51.5620 28.8842 54.0773 18.1139 28.0493 22.4349 6.4314 32.2006 21.3839 3.8687 27.5264 5.3298 30.1963 22.2980 27.4256 6.8785 4.4484 5.5611
temp: 298.150 k
press: 1.00000 atm
elementType: 16 16 8 8 8 8 7 6 6 6 6 6 6 6 6 6 6 6 6 6 6 6 6 1 1 1 1 1 1 1 1 1 1 1 1 1 1 1 1 1 1 1
symmnumber: 1
zpe: 846304.1 jmol-1
zpe.correction: 0.322340 hartree
zpe.thermalcorrener: 0.345271 hartree
zpe.thermalcorrenthalpy: 0.346215 hartree
zpe.thermalcorrgfe: 0.268245 hartree
zpe.sumelectzpe: -1771.113171 hartree
zpe.sumelectthermal: -1771.090240 hartree
zpe.sumelectthermalent: -1771.089296 hartree
zpe.sumelectthermalfe: -1771.167266 hartree
dipole: -1.6738 5.0043 -1.6289
dipole: 5.5225
quadrupole: -131.8711 -136.1246 -153.7674
quadrupole: -16.5883 5.0891 9.2328
quadrupole: 8.7166 4.4631 -13.1797 -16.5883 5.0891 9.2328
hfenergy: -1771.4355108 hartree
pointgroup: C01 [X(C16H19N1O4S2)]
dipole: -0.6107517 1.7949942 -1.0609773 debye
polarizability: 216.4021841|-24.7123822|276.3129795|4.9556801|-36.7372925|226.1788 unknown
InChI: InChI=1S/C16H19NO4S2/c1-4-21-10-14-15(18)17(16(22)23-14)8-7-11-5-6-12(19-2)13(9-11)20-3/h5-6,9-10H,4,7-8H2,1-3H3
charge 0 multiplicity 1
42 atoms
S  -2.983984 -0.734436 1.102611
S  -1.572021 -3.270855 2.181815
O  3.137086 1.157338 2.428969
O  3.621605 2.468295 -0.146161
O  -1.028231 -0.926294 -2.345392
O  -4.025312 1.696601 -0.625868
N  -1.120724 -2.056631 -0.258272
C  1.271399 -2.820875 0.109845
C  -0.066308 -3.022789 -0.648228
C  1.85847 -1.416306 0.036132
C  2.216552 -0.741482 1.228603
C  -1.511175 -1.028087 -1.182905
C  2.076112 -0.758317 -1.202712
C  -1.774939 -2.119322 0.965923
C  2.790678 0.547007 1.197787
C  -2.537139 -0.171248 -0.57068
C  2.6686 0.521025 -1.24399
C  3.047494 1.176629 -0.052898
C  -3.06536 0.911392 -1.215539
C  -4.497964 2.875703 -1.415587
C  2.383623 2.397199 2.727699
C  5.004368 2.564551 0.377281
C  -5.583821 3.556164 -0.591577
H  1.125201 -3.111164 1.164559
H  1.981742 -3.552915 -0.326186
H  0.063177 -2.889597 -1.736074
H  -0.446175 -4.040764 -0.448085
H  2.042234 -1.200587 2.208102
H  1.775882 -1.238189 -2.14032
H  2.853509 1.030536 -2.195136
H  -2.71533 1.160964 -2.227703
H  -3.633071 3.544125 -1.590478
H  -4.884346 2.512031 -2.387492
H  2.790981 2.765664 3.681677
H  1.307152 2.167781 2.841934
H  2.524803 3.148172 1.92918
H  5.683819 1.936927 -0.230245
H  5.05007 2.249504 1.435296
H  5.283246 3.624667 0.276207
H  -5.964669 4.441435 -1.131916
H  -6.426196 2.868074 -0.409875
H  -5.18574 3.886176 0.382498
