program: Gaussian 09
title: 000295544
version: EM64L-G09RevD.01
frameworkgroup: C1[X(C13H16N2)]
method: RPBEPBE
basis: SDD
operation: Freq
keyword: #pfreq=noraman
keyword: PBEPBE/SDD
title: #p freq=noraman PBEPBE/SDD
converged: NO YES NO NO
title: Mulliken charges:
elementType: N N C C C C C C C C C C C C C H H H H H H H H H H H H H H H H
charge: -0.019666 -0.019667 0.088998 0.089001 -0.641280 0.368350 0.368353 0.162865 0.162865 -0.582765 -0.582768 -0.817746 -0.817747 -0.777766 -0.777765 0.220429 0.271823 0.256584 0.256583 0.234873 0.224857 0.223271 0.224849 0.234874 0.223279 0.259896 0.223803 0.228960 0.259896 0.228959 0.223803
chargesum: 0.00000
title: Mulliken charges with hydrogens summed into heavy atoms:
elementType: N N C C C C C C C C C C C C C
charge: -0.019666 -0.019667 0.088998 0.089001 -0.149028 0.368350 0.368353 0.162865 0.162865 -0.326181 -0.326185 -0.134745 -0.134745 -0.065108 -0.065107
polarizability: 2.57054495e+02 -2.41406226e-05 1.56966915e+02 3.62723418e+00 -2.65596389e-04 8.97535066e+01
1716.lowfreq: -11.2152 -7.3978 -0.0006 -0.0003 0.0009 12.4791 70.7557 81.2403 113.9468
frequency: 70.7284 81.2325 113.9413 120.3153 142.5441 160.0908 169.2263 171.5314 215.8604 232.7148 284.2271 294.0084 320.6969 335.1839 358.1432 386.5653 400.5477 442.8074 466.3010 471.8469 518.4032 580.0254 581.1355 631.1426 642.9113 733.0704 735.6840 755.8672 771.3040 832.9279 846.0269 894.5144 896.6043 922.0088 963.7520 996.8713 1009.9297 1012.5379 1031.6311 1039.4322 1051.6534 1051.9748 1074.8935 1143.0592 1184.5734 1200.2643 1243.1604 1247.3312 1251.5036 1271.9215 1284.7426 1364.3884 1377.7275 1385.3425 1391.9024 1399.5181 1404.5988 1440.6281 1449.4636 1455.9245 1457.4825 1460.8739 1462.1942 1469.4335 1472.9056 1476.6803 1481.7009 1527.1174 1595.6559 1613.4274 1637.5991 2967.7392 2968.0853 2969.8070 2970.9479 2974.0446 3037.7126 3040.0010 3043.5206 3044.3455 3084.0645 3085.8875 3086.6087 3119.0850 3119.6194 3137.4691 3140.5611
redmass: 3.2285 3.4367 2.8328 1.1342 1.7535 1.0549 1.3234 1.1070 3.0950 2.7626 2.5164 3.6594 2.7468 3.4759 4.7481 3.7476 3.9008 2.8972 3.7166 3.1159 4.2002 3.4841 4.2880 4.6363 4.0607 5.4444 5.1231 4.2197 3.5131 3.9552 2.8614 1.3749 1.4642 1.7356 1.6821 1.4075 1.5327 1.4505 1.4527 1.6770 1.7802 1.6320 2.2635 2.3112 1.6938 4.7678 1.4305 4.8717 1.3077 1.9426 6.0317 5.8808 1.3933 1.2864 1.3251 2.9265 1.2271 1.0962 1.0753 1.0986 1.0500 1.0496 1.0471 1.1504 1.2423 1.0517 3.2421 4.3276 6.9314 7.9581 7.0896 1.0376 1.0384 1.0404 1.0384 1.0620 1.0968 1.0967 1.0963 1.0963 1.0983 1.0980 1.0976 1.0984 1.0980 1.0911 1.0919
irintensity: 0.1645 6.0906 0.0430 0.0879 2.7036 0.1891 0.2725 0.4732 2.0801 0.0158 0.2209 2.2328 1.7689 0.4928 0.6537 0.0009 10.0461 1.6451 1.0723 3.8928 4.6006 0.2483 1.0228 1.9765 0.3910 1.1290 9.8677 5.0093 3.7609 0.2016 7.5056 27.6327 0.0084 5.4859 12.7059 31.1319 0.8826 2.8151 17.2186 0.0168 3.0852 0.0139 0.1555 6.6562 3.8088 35.6845 1.5916 20.1780 14.1534 58.3825 4.4042 2.7379 8.5307 42.3476 12.9347 0.5834 12.1267 31.2464 3.5022 22.5306 12.0742 22.9871 0.0495 22.1322 1.6774 30.4069 35.4188 3.7861 1.7275 70.4248 2.5105 97.7338 10.1282 24.6150 4.9372 35.6299 45.7006 0.0012 23.2932 14.2096 38.0628 21.4425 3.4165 12.1092 9.5496 15.8000 2.7914
temp: 298.150 k
press: 1.00000 atm
elementType: 7 7 6 6 6 6 6 6 6 6 6 6 6 6 6 1 1 1 1 1 1 1 1 1 1 1 1 1 1 1 1
symmnumber: 1
zpe: 674415.3 jmol-1
zpe.correction: 0.256871 hartree
zpe.thermalcorrener: 0.271659 hartree
zpe.thermalcorrenthalpy: 0.272604 hartree
zpe.thermalcorrgfe: 0.216239 hartree
zpe.sumelectzpe: -613.389242 hartree
zpe.sumelectthermal: -613.374454 hartree
zpe.sumelectthermalent: -613.373510 hartree
zpe.sumelectthermalfe: -613.429874 hartree
dipole: 1.2086 0.0000 1.6954
dipole: 2.0821
quadrupole: -68.5334 -90.6581 -92.1095
quadrupole: 0.0000 1.8857 -0.0001
quadrupole: 15.2336 -6.8911 -8.3425 0.0000 1.8857 -0.0001
hfenergy: -613.6461133 hartree
pointgroup: C01 [X(C13H16N2)]
dipole: -0.4748308 0.0000014 -0.6675111 debye
polarizability: 257.0469127|0.0035373|156.966915|3.798071|0.0022843|89.7610893 unknown
InChI: InChI=1S/C13H16N2/c1-8-5-12-13(6-9(8)2)15-11(4)7-10(3)14-12/h5-6H,7H2,1-4H3
charge 0 multiplicity 1
31 atoms
N  -1.041823 1.538349 0.258678
N  -1.041711 -1.538873 0.258598
C  0.099507 0.721131 0.069998
C  0.09956 -0.721562 0.06996
C  -2.434442 -0.000277 -1.104698
C  2.580797 0.719192 -0.07855
C  2.58085 -0.719435 -0.078589
C  -2.227743 1.222547 -0.206928
C  -2.227654 -1.223132 -0.206991
C  1.354913 1.395532 0.029114
C  1.355015 -1.395869 0.02904
C  3.882864 1.495197 -0.158235
C  3.882971 -1.495341 -0.158342
C  -3.428975 2.059275 0.168274
C  -3.428827 -2.059964 0.168171
H  -3.431013 -0.000301 -1.573969
H  -1.651732 -0.000227 -1.891193
H  1.326729 2.489723 0.08056
H  1.32691 -2.490066 0.080432
H  3.700575 2.582724 -0.137562
H  4.556436 1.247951 0.685268
H  4.440176 1.262068 -1.086425
H  4.55666 -1.247895 0.685008
H  3.700778 -2.58288 -0.137463
H  4.440112 -1.262321 -1.086664
H  -3.123034 2.883639 0.830074
H  -4.190618 1.444073 0.686723
H  -3.916711 2.475123 -0.734724
H  -3.122827 -2.884336 0.829933
H  -3.91653 -2.475806 -0.734848
H  -4.190514 -1.444839 0.686646
