program: Gaussian 09
title: 000295536
version: EM64L-G09RevD.01
frameworkgroup: C1[X(C18H16N2O2)]
method: RPBEPBE
basis: SDD
operation: Freq
keyword: #p
keyword: freq=noraman
keyword: PBEPBE/SDD
title: #p freq=noraman PBEPBE/SDD
converged: YES YES NO NO
title: Mulliken charges:
elementType: O O N N C C C C C C C C C C C C C C C C C C H H H H H H H H H H H H H H H H
charge: -0.304645 -0.305325 -0.044866 -0.005372 0.390690 0.047499 0.199500 -0.284753 0.061245 -0.407098 0.241088 0.060540 -0.341955 -0.356431 -0.230678 -0.343517 -0.460563 -0.314311 -0.215094 -0.223712 -0.527012 -0.527648 0.304020 0.230602 0.221246 0.254078 0.229603 0.261299 0.240427 0.259377 0.232804 0.233818 0.228383 0.232134 0.255693 0.256090 0.222909 0.229935
chargesum: 0.00000
title: Mulliken charges with hydrogens summed into heavy atoms:
elementType: O O N N C C C C C C C C C C C C C C C C C C
charge: -0.304645 -0.305325 -0.044866 -0.005372 0.390690 0.047499 0.199500 0.019267 0.061245 -0.176496 0.241088 0.060540 -0.120708 -0.102353 -0.001075 -0.082218 -0.220136 -0.054933 0.017709 0.010106 0.189198 0.181287
polarizability: 4.73165819e+02 -3.46275748e+01 2.44979686e+02 8.53627005e-02 1.92678181e+00 9.69442194e+01
1716.lowfreq: -2.6837 0.0009 0.0010 0.0010 4.6779 10.8106 22.4266 34.5256 39.2173
frequency: 22.2004 34.4727 39.1530 63.4100 82.0324 105.4737 128.0147 146.3612 159.3472 161.2559 164.3241 174.3990 178.1070 221.8412 248.4750 266.2827 316.5297 346.4939 351.5525 390.9286 417.8193 436.8853 483.2673 485.4168 490.0848 523.1576 532.5485 543.0474 555.6009 582.8619 603.5100 608.6423 674.7316 685.3658 738.5792 750.0199 773.5234 777.2482 793.8246 799.3842 811.0903 880.6978 886.8040 893.7139 901.9854 906.7333 928.8360 945.5961 971.1573 971.2283 980.3724 994.5579 997.2057 1010.7593 1028.4773 1067.2385 1111.9899 1112.4114 1115.1678 1145.0555 1149.1046 1153.5800 1165.4569 1177.7045 1192.0104 1206.5448 1234.4434 1247.6814 1264.1850 1281.2414 1294.0633 1321.7530 1342.1792 1367.5730 1374.2442 1407.0012 1416.0175 1428.8871 1441.8660 1456.6592 1458.5269 1461.6544 1464.7319 1471.8711 1477.5965 1486.8143 1511.5784 1548.4585 1573.9789 1589.7224 1614.1307 1635.5922 2974.2011 2975.9044 3072.5465 3074.5841 3105.1381 3113.6723 3123.2109 3124.1662 3133.9778 3135.8879 3142.1374 3147.8252 3153.5758 3162.6088 3170.9719 3172.5093
redmass: 4.7303 4.9136 5.1726 4.5466 3.4139 2.7475 4.0053 3.3218 1.4885 2.0242 1.3644 2.4913 4.3039 4.9391 3.2901 3.9534 4.3711 5.4340 4.9799 4.7758 4.1165 5.6138 5.4983 4.7856 5.3149 7.3285 3.7282 4.3639 4.8069 4.8028 8.4719 4.3919 6.9210 3.2678 5.6702 1.8674 1.3593 5.0690 5.2416 2.8384 2.5769 1.6649 1.7258 4.3390 1.6846 4.8245 1.6830 9.1310 1.3569 1.3499 5.3567 5.2656 1.3255 2.0500 1.1639 2.0296 1.7269 1.2392 1.2371 1.4768 1.4094 1.3500 2.0562 1.6452 1.6254 1.6288 2.4531 1.9190 2.1921 2.2466 1.8943 2.7783 2.3244 4.4179 2.7272 2.4073 2.0614 1.3667 1.6965 1.8365 1.1083 1.2244 2.6336 3.5159 1.0727 1.0529 6.3258 6.8713 6.5835 6.3324 6.2538 5.8051 1.0308 1.0307 1.1035 1.1044 1.0911 1.0918 1.1030 1.1030 1.0858 1.0859 1.0875 1.0894 1.0924 1.0957 1.0986 1.1005
irintensity: 0.0417 0.3383 0.0613 0.4008 8.3581 6.5274 0.3026 0.5070 1.2544 1.2411 0.3578 3.1976 1.8978 10.5154 4.7947 9.1091 0.3712 2.0119 4.8412 9.1463 5.9092 2.7509 7.5946 6.4862 4.3143 0.2597 0.1958 0.8980 0.9736 3.8543 6.3568 2.5257 15.4772 2.6945 5.7076 26.0489 99.1813 22.4416 2.4966 15.5022 16.5039 0.2188 0.5482 6.7958 2.2588 4.2846 21.6905 54.1532 3.0022 2.1375 8.1212 93.0054 0.0060 13.1209 40.1503 27.3741 4.2603 9.1648 6.1389 9.2383 17.8480 0.7480 20.5513 16.3194 6.5138 22.9390 158.0339 26.9531 109.6678 2.1859 16.1284 0.8321 3.4258 15.8536 23.3779 30.1890 5.8198 8.3460 64.7297 16.0488 13.5069 3.0689 10.0224 10.8748 3.7004 22.6456 198.3678 2.4465 30.0477 0.7928 5.6567 115.7906 89.8975 48.6664 27.4606 22.9854 6.2281 32.9479 26.1841 17.0699 2.1897 4.7787 8.5444 7.0109 12.4146 15.1121 20.9213 35.4628
temp: 298.150 k
press: 1.00000 atm
elementType: 8 8 7 7 6 6 6 6 6 6 6 6 6 6 6 6 6 6 6 6 6 6 1 1 1 1 1 1 1 1 1 1 1 1 1 1 1 1
symmnumber: 1
zpe: 774683.8 jmol-1
zpe.correction: 0.295061 hartree
zpe.thermalcorrener: 0.314577 hartree
zpe.thermalcorrenthalpy: 0.315521 hartree
zpe.thermalcorrgfe: 0.245612 hartree
zpe.sumelectzpe: -953.872045 hartree
zpe.sumelectthermal: -953.852529 hartree
zpe.sumelectthermalent: -953.851585 hartree
zpe.sumelectthermalfe: -953.921494 hartree
dipole: -1.4116 -1.3292 0.0226
dipole: 1.9390
quadrupole: -115.2334 -111.7719 -131.1581
quadrupole: -8.0228 4.0429 -0.5140
quadrupole: 4.1544 7.6159 -11.7703 -8.0228 4.0429 -0.5140
hfenergy: -954.167106 hartree
pointgroup: C01 [X(C18H16N2O2)]
dipole: 0.5535563 0.5247477 0.0137416 debye
polarizability: 473.3898343|-33.861811|244.7675413|1.2363105|-1.3099747|96.9323493 unknown
InChI: InChI=1S/C18H16N2O2/c1-21-17-9-5-6-13(18(17)22-2)10-11-14-12-19-15-7-3-4-8-16(15)20-14/h3-12H,1-2H3
charge 0 multiplicity 1
38 atoms
O  2.677016 1.611059 0.023638
O  5.519416 1.123856 0.091232
N  -1.974617 0.257535 -0.045779
N  -3.940939 -1.855004 -0.027975
C  2.262962 -0.800684 0.019076
C  3.185033 0.293432 0.050284
C  4.589311 0.058813 0.059644
C  0.825726 -0.510344 -0.009325
C  -3.329225 0.540089 -0.067163
C  2.797279 -2.124045 0.031489
C  -1.612561 -1.053803 -0.017549
C  -4.326112 -0.515562 -0.057465
C  -0.195289 -1.42595 0.009708
C  5.086107 -1.259912 0.096344
C  4.18406 -2.350599 0.08701
C  -3.761078 1.904422 -0.098833
C  -2.621817 -2.096337 -0.009318
C  -5.713322 -0.182404 -0.078017
C  -5.125702 2.204671 -0.118567
C  -6.106768 1.15933 -0.10786
C  2.926469 2.399662 1.255276
C  5.515341 1.992819 -1.11025
H  0.547149 0.549188 -0.0518
H  2.114601 -2.97953 0.003288
H  0.007492 -2.504597 0.048398
H  6.17029 -1.407699 0.120628
H  4.571781 -3.374471 0.108583
H  -2.993809 2.68476 -0.107549
H  -2.312961 -3.149177 0.014114
H  -6.438706 -1.002054 -0.06989
H  -5.455087 3.249307 -0.142917
H  -7.170795 1.419091 -0.123753
H  2.395447 1.940789 2.110222
H  2.514238 3.399036 1.049702
H  4.008653 2.460448 1.468227
H  4.518244 2.439284 -1.27249
H  5.815729 1.408637 -2.000707
H  6.262144 2.774951 -0.90576
