program: Gaussian 09
title: 000297591
version: EM64L-G09RevD.01
frameworkgroup: C1[X(C16H13N)]
method: RPBEPBE
basis: SDD
operation: Freq
keyword: #pfreq=noraman
keyword: PBEPBE/SDD
title: #p freq=noraman PBEPBE/SDD
converged: YES YES NO YES
title: Mulliken charges:
elementType: N C C C C C C C C C C C C C C C C H H H H H H H H H H H H H
charge: -0.478161 0.174785 -0.532152 0.052045 -0.601384 0.247339 0.358919 0.167877 0.198768 -0.402787 -0.432015 -0.425123 -0.365247 -0.255256 -0.243933 -0.253323 -0.223631 0.219208 0.227560 0.224465 0.230939 0.307031 0.214043 0.234420 0.232503 0.230103 0.226614 0.226825 0.219361 0.220207
chargesum: 0.00000
title: Mulliken charges with hydrogens summed into heavy atoms:
elementType: N C C C C C C C C C C C C C C C C
charge: -0.171130 0.174785 -0.085384 0.052045 -0.145980 0.247339 0.358919 0.167877 0.198768 -0.188745 -0.197595 -0.192620 -0.135144 -0.028642 -0.017109 -0.033962 -0.003424
polarizability: 3.23218639e+02 8.70620701e+00 1.79366083e+02 9.88906938e-01 -9.85937601e-01 7.85412202e+01
1716.lowfreq: -14.1516 -3.7293 -0.0005 -0.0002 0.0005 6.6360 58.1170 90.5114 135.2621
frequency: 58.1099 90.5071 135.2559 162.4759 189.2409 240.9177 283.1413 299.7393 332.3241 375.9181 420.2476 433.3108 459.8756 498.5740 519.9887 523.0577 545.8917 571.9364 575.3797 611.9572 658.8019 682.1099 713.2505 731.8218 747.6207 754.3310 766.7089 770.0383 822.5067 848.3122 866.9054 878.6800 908.4819 928.1748 939.4500 968.6328 971.1600 980.4783 1009.3964 1026.7314 1033.6611 1042.4609 1094.6343 1120.9146 1158.8403 1167.5639 1173.0590 1175.7972 1201.3859 1207.6099 1238.9250 1252.3586 1283.4540 1307.3374 1325.3401 1333.0119 1367.1373 1379.0405 1408.6596 1433.4699 1435.1930 1450.1377 1463.7339 1466.7104 1483.6507 1505.3471 1559.0662 1580.1149 1590.6936 1613.4243 1630.4950 2950.8030 2958.2734 3028.7099 3041.3319 3113.2164 3119.5362 3122.4368 3129.9434 3138.6671 3143.9026 3160.8976 3161.7376 3612.9074
redmass: 5.0781 3.5373 4.3257 3.7053 3.0559 2.8925 5.1080 4.1279 3.4452 5.1745 2.8032 3.0751 3.5828 1.2720 2.9814 4.2639 5.2781 5.4050 3.9744 3.8430 5.0088 4.8149 2.8129 3.0312 1.3832 3.1617 3.0042 1.7756 4.6867 1.4772 1.4066 3.1207 3.4689 1.3836 1.4073 1.3112 2.7947 1.3293 2.1351 2.5222 2.6369 2.2472 2.4743 1.5385 1.2595 1.1298 1.2988 1.3232 2.1709 1.5177 1.6308 1.9363 1.4378 1.3641 2.1567 1.9974 2.2462 5.0474 3.3989 3.2497 2.1983 1.1283 1.3309 2.5696 3.3596 3.8090 6.5809 6.3363 6.5959 6.8804 7.0789 1.0696 1.0630 1.0933 1.0953 1.0866 1.0888 1.0848 1.0890 1.0926 1.0952 1.1004 1.1001 1.0801
irintensity: 0.4044 0.2916 0.5240 2.3065 0.4295 1.2317 1.0861 3.8436 0.6547 1.1019 1.7571 7.9983 2.0410 78.1019 14.2487 7.8890 3.1279 1.9318 0.9888 0.5005 4.6240 0.2396 3.1924 15.3448 133.1644 20.3390 3.2003 37.5850 1.6446 0.0668 0.4002 2.0245 1.4947 2.8285 2.3907 0.0449 2.0720 0.0326 8.7402 1.7713 2.1455 10.6691 11.7454 4.1914 0.6590 1.0231 0.0350 0.3600 2.1642 3.7017 18.6949 3.7338 11.2605 6.7235 34.4833 20.9753 16.0091 3.9474 33.2294 1.8092 17.5865 15.9892 1.3832 20.9674 0.9241 20.2459 4.6835 0.9386 0.4133 23.3631 3.2690 29.8616 37.3098 31.8753 37.2063 19.2278 3.0467 1.5729 2.3821 27.6304 35.6315 53.0037 30.4337 39.3683
temp: 298.150 k
press: 1.00000 atm
elementType: 7 6 6 6 6 6 6 6 6 6 6 6 6 6 6 6 6 1 1 1 1 1 1 1 1 1 1 1 1 1
symmnumber: 1
zpe: 636814.3 jmol-1
zpe.correction: 0.242550 hartree
zpe.thermalcorrener: 0.254851 hartree
zpe.thermalcorrenthalpy: 0.255795 hartree
zpe.thermalcorrgfe: 0.204260 hartree
zpe.sumelectzpe: -671.129471 hartree
zpe.sumelectthermal: -671.117170 hartree
zpe.sumelectthermalent: -671.116226 hartree
zpe.sumelectthermalfe: -671.167761 hartree
dipole: -1.0122 -0.7588 0.2631
dipole: 1.2921
quadrupole: -92.8108 -82.4296 -105.9822
quadrupole: -1.6112 0.2696 -0.8177
quadrupole: 0.9301 11.3113 -12.2413 -1.6112 0.2696 -0.8177
hfenergy: -671.3720211 hartree
pointgroup: C01 [X(C16H13N1)]
dipole: -0.4002049 0.295686 -0.1040404 debye
polarizability: 323.323235|-7.7836153|179.2537489|-1.1328422|-1.2657204|78.5489585 unknown
InChI: InChI=1S/C16H13N/c1-2-6-12-11(5-1)9-10-14-13-7-3-4-8-15(13)17-16(12)14/h1-8,17H,9-10H2
charge 0 multiplicity 1
30 atoms
N  0.707425 1.414117 -0.168966
C  0.53198 -0.853564 0.082879
C  -0.188815 -2.16513 0.284218
C  -0.192453 0.337405 -0.062952
C  -1.572236 -2.112735 -0.421254
C  -1.649602 0.412788 -0.028052
C  -2.355736 -0.830039 -0.146094
C  1.93392 -0.510719 0.070068
C  2.016995 0.92312 -0.099631
C  -2.376722 1.620218 0.143246
C  -3.764343 -0.823784 -0.076687
C  3.137011 -1.25969 0.179989
C  3.251709 1.602471 -0.172639
C  -3.787252 1.608373 0.196552
C  -4.485386 0.383945 0.091022
C  4.370648 -0.584292 0.112169
C  4.42781 0.830946 -0.063803
H  0.398864 -3.011095 -0.119117
H  -0.323596 -2.36284 1.36893
H  -2.179189 -2.993935 -0.143202
H  -1.398131 -2.176913 -1.51682
H  0.450011 2.383512 -0.337898
H  -1.844839 2.572776 0.259777
H  -4.307827 -1.772654 -0.16354
H  3.105887 -2.346749 0.315234
H  3.303429 2.689112 -0.304836
H  -4.337669 2.546139 0.33018
H  -5.579624 0.367664 0.141122
H  5.305674 -1.149498 0.19509
H  5.403654 1.326952 -0.113682
