program: Gaussian 09
title: 000297584
version: EM64L-G09RevD.01
frameworkgroup: C1[X(C9H10F4Si)]
method: RPBEPBE
basis: SDD
operation: Freq
keyword: #p
keyword: freq=noraman
keyword: PBEPBE/SDD
title: #p freq=noraman PBEPBE/SDD
converged: YES YES NO NO
title: Mulliken charges:
elementType: Si F F F F C C C C C C C C C H H H H H H H H H H
charge: 1.283216 -0.181068 -0.153931 -0.174614 -0.151398 -0.241660 -1.040282 -1.005054 -1.005102 0.194685 -0.413410 0.096554 0.239072 0.055898 0.241845 0.252681 0.241817 0.239855 0.237766 0.261015 0.261086 0.237757 0.239834 0.283439
chargesum: 0.00000
title: Mulliken charges with hydrogens summed into heavy atoms:
elementType: Si F F F F C C C C C C C C C
charge: 1.283216 -0.181068 -0.153931 -0.174614 -0.151398 -0.241660 -0.303939 -0.266418 -0.266426 0.194685 -0.129972 0.096554 0.239072 0.055898
polarizability: 1.55367152e+02 1.54737681e+00 1.27373499e+02 -7.00955810e-03 2.89100312e-03 8.21311561e+01
1716.lowfreq: -7.2883 -1.8504 -0.0019 -0.0007 -0.0006 11.3814 36.5388 65.1333 105.5122
frequency: 36.2723 65.0898 105.5014 127.7912 139.7430 143.4838 145.0105 172.1911 180.2558 186.2925 188.0838 224.7290 238.8567 255.0711 267.2175 294.2798 303.4462 341.6381 383.3911 444.0960 484.5764 552.1014 603.6161 613.0648 621.2842 671.2781 701.2480 701.9556 724.1503 749.8314 787.7093 811.0098 820.9136 868.2961 909.9697 912.7729 920.1187 951.0825 1024.1322 1175.7949 1200.0775 1282.6109 1297.4395 1299.6090 1312.5655 1361.3936 1409.3287 1441.2465 1448.1063 1449.1985 1453.0064 1459.8806 1465.2069 1470.2793 1584.6199 1606.4212 2982.2276 2986.8229 2987.3659 3083.2165 3085.9688 3087.6504 3088.5413 3099.6195 3100.4604 3171.5362
redmass: 3.7739 4.9497 4.2768 1.6732 2.4620 5.1839 1.0377 2.8555 1.0509 2.9920 2.9510 4.0950 3.9924 18.0535 12.8919 7.8226 6.2238 6.8708 10.5685 14.9042 13.6083 4.9795 4.2232 6.1726 9.6960 9.5626 3.1723 3.1286 7.7957 1.1718 8.0609 1.3828 1.3740 1.3697 1.5060 1.4994 1.7678 5.8313 10.3705 5.4377 1.8577 5.8730 1.1985 1.2018 1.1914 11.5329 6.9068 1.0530 1.0803 1.0543 1.0696 1.0480 1.1401 3.7570 9.4307 10.7485 1.0347 1.0343 1.0342 1.0975 1.0988 1.0982 1.0977 1.0988 1.0983 1.0916
irintensity: 0.0192 0.0410 0.1923 0.4128 0.3426 0.6911 0.0347 0.1478 0.0018 0.4242 0.1845 0.7729 4.7537 0.0146 0.3834 11.1796 1.5134 7.8327 2.6032 0.7877 3.1444 4.3914 13.6379 2.0779 0.7238 10.3220 9.7325 9.3332 1.1965 0.0002 32.2451 15.9888 28.4022 10.5869 81.9399 62.9666 137.8507 170.5526 92.2793 10.4203 7.8650 86.5429 42.8975 43.6118 14.0025 26.7696 182.4575 0.0992 6.7436 0.2261 3.7263 11.7487 54.5890 88.6347 14.4102 6.5514 9.7776 13.7994 10.3169 7.8392 5.2047 16.0021 32.5743 3.3976 14.1431 2.4257
temp: 298.150 k
press: 1.00000 atm
elementType: 14 9 9 9 9 6 6 6 6 6 6 6 6 6 1 1 1 1 1 1 1 1 1 1
symmnumber: 1
zpe: 437006.3 jmol-1
zpe.correction: 0.166447 hartree
zpe.thermalcorrener: 0.182555 hartree
zpe.thermalcorrenthalpy: 0.183499 hartree
zpe.thermalcorrgfe: 0.123266 hartree
zpe.sumelectzpe: -1036.671026 hartree
zpe.sumelectthermal: -1036.654918 hartree
zpe.sumelectthermalent: -1036.653973 hartree
zpe.sumelectthermalfe: -1036.714206 hartree
dipole: -4.1079 1.5484 0.0001
dipole: 4.3900
quadrupole: -92.4906 -94.1512 -86.5221
quadrupole: -2.4500 0.0000 0.0007
quadrupole: -1.4360 -3.0965 4.5325 -2.4500 0.0000 0.0007
hfenergy: -1036.8374724 hartree
pointgroup: C01 [X(C9H10F4Si1)]
dipole: -1.6045235 0.6391283 0.0097661 debye
dipolederiv: 1.7440573 -0.077481 -0.0033343 -0.0956972 1.1347996 0.0007172 -0.0031956 0.0005942 1.224165 -0.3935163 -0.2930811 0.0022449 -0.2706147 -0.7355769 0.0029815 0.0022832 0.0032887 -0.1319513 -0.4280766 0.3539753 0.0016834 0.4404202 -0.7913065 -0.0017313 0.0015384 -0.0011217 -0.0865173 -0.512699 -0.3724083 0.0033954 -0.4817673 -0.7564383 0.0044334 0.0036026 0.0036702 -0.1121417 -1.1001456 0.0250583 0.0069885 0.0490636 -0.1558646 -0.0002048 0.0069909 -0.000057 -0.0815288 -0.4191898 0.0981599 0.000209 -0.024398 -0.3600361 0.0002397 0.0004959 -0.0006071 -0.3512743 -0.4108584 0.0722291 0.0007 0.0741925 -0.4356624 0.0000456 0.0004775 0.0001288 -0.2876393 -0.4179617 -0.0118191 0.043775 0.0065303 -0.3236333 0.0542221 0.014255 0.0616195 -0.3842575 -0.4186749 -0.0128888 -0.043209 0.0056771 -0.3244816 -0.0546271 -0.0138908 -0.0618223 -0.3828177 0.2678915 0.4369873 -0.0020182 0.2318139 0.7655142 -0.0028631 -0.0017796 -0.0044519 0.0889828 -0.1758014 -0.1493951 0.0007101 0.0769411 -0.0170653 -0.0006851 0.0003225 0.0008988 -0.1038894 0.3577555 -0.4655847 -0.0010242 -0.4781986 0.8145076 0.0019485 -0.0009848 0.0018418 0.0808247 0.4430512 0.4179157 -0.0031843 0.5919978 0.8288757 -0.0053533 -0.0034579 -0.0041349 0.0871757 1.1568274 -0.0300658 -0.0075265 -0.1050902 0.0171758 0.0008052 -0.007477 0.0003129 0.0613078 0.1035021 -0.0587189 0.054841 -0.0610904 0.0173405 0.1184484 0.0606414 0.0866656 -0.0388474 -0.1418894 0.0444997 0.0013528 0.0713488 0.1086383 -0.0004455 0.0012854 -0.0002675 0.1108991 0.1021176 -0.060097 -0.0562152 -0.0628125 0.0160312 -0.1180592 -0.0618528 -0.0863569 -0.0361762 0.1014978 -0.0278344 -0.0535835 -0.0132452 0.0692418 -0.068412 -0.0686236 -0.0796409 -0.0946604 -0.1627068 -0.0095676 0.0268196 -0.0424043 0.1123794 0.0059874 0.0836913 0.0048983 0.0950916 0.1217393 0.0521692 -0.0129205 0.0571234 -0.0869504 0.0243979 -0.0330827 0.0312738 0.1035731 0.1224404 0.0518927 0.012439 0.0570648 -0.0870964 -0.0239487 0.032581 -0.0307671 0.1033818 -0.1641106 -0.0099121 -0.0232995 -0.0430584 0.112321 -0.0055063 -0.0799111 -0.0048821 0.0966277 0.1030909 -0.0264476 0.0510903 -0.0119032 0.0701388 0.0675743 0.0660219 0.0790669 -0.0971603 0.1216594 0.0524143 0.0000663 0.0281066 0.0071481 0.0000352 0.0000688 -0.00015 0.1368322 unknown
polarizability: 155.4115222|1.0250317|127.3254817|-0.5068822|-0.0871715|82.1348033 unknown
InChI: InChI=1S/C9H10F4Si/c1-14(2,3)6-4-5(10)7(11)9(13)8(6)12/h4H,1-3H3
charge 0 multiplicity 1
24 atoms
Si -2.564679 0.258369 0.013621
F  -0.651172 -2.22855 0.005527
F  2.117953 -2.333265 -0.013498
F  2.316498 2.497918 -0.023488
F  3.618753 0.025923 -0.028197
C  -0.630826 0.205207 0.000764
C  -3.076684 2.098912 0.011071
C  -3.181545 -0.616521 1.594875
C  -3.202458 -0.626433 -1.553755
C  0.066707 -1.017226 -0.001865
C  0.155117 1.389614 -0.006613
C  1.472992 -1.101482 -0.011344
C  1.557183 1.32347 -0.016211
C  2.23108 0.085515 -0.018686
H  -2.712241 2.626342 -0.889569
H  -4.179377 2.17855 0.017211
H  -2.701886 2.631995 0.904096
H  -2.803731 -0.113677 2.503337
H  -4.286532 -0.610804 1.635779
H  -2.842128 -1.667016 1.61579
H  -2.86278 -1.676872 -1.572735
H  -4.307892 -0.621399 -1.579927
H  -2.837004 -0.128998 -2.47022
H  -0.315346 2.376825 -0.005064
