program: Gaussian 09
title: 000297582
version: EM64L-G09RevD.01
frameworkgroup: C1[X(C13H3F9O)]
method: RPBEPBE
basis: SDD
operation: Freq
keyword: #p
keyword: freq=noraman
keyword: PBEPBE/SDD
title: #p freq=noraman PBEPBE/SDD
converged: YES YES NO NO
title: Mulliken charges:
elementType: F F F F F F F F F O C C C C C C C C C C C C C H H H
charge: -0.139495 -0.157656 -0.159575 -0.158032 -0.149383 -0.132259 -0.140992 -0.139728 -0.138427 -0.235146 0.094957 0.231299 0.118602 0.047151 0.135656 0.116075 0.120018 0.211878 0.106957 -0.759553 0.124720 0.129914 0.110075 0.255430 0.253747 0.253767
chargesum: 0.00000
title: Mulliken charges with hydrogens summed into heavy atoms:
elementType: F F F F F F F F F O C C C C C C C C C C C C C
charge: -0.139495 -0.157656 -0.159575 -0.158032 -0.149383 -0.132259 -0.140992 -0.139728 -0.138427 -0.235146 0.094957 0.231299 0.118602 0.047151 0.135656 0.116075 0.120018 0.211878 0.106957 0.003391 0.124720 0.129914 0.110075
polarizability: 2.24409656e+02 2.73885612e+00 1.26288991e+02 -1.18130474e+01 -4.59031147e-01 1.05455516e+02
1716.lowfreq: -2.9291 -0.0010 -0.0009 -0.0007 2.3367 4.8824 17.3342 23.3397 38.8835
frequency: 17.2682 23.3333 38.8825 61.6749 96.6460 107.2957 122.6887 124.7582 156.6614 157.2828 162.8752 199.9909 205.1135 251.8282 255.8154 259.3427 266.8383 268.4637 281.3770 285.7494 305.7788 313.1876 345.2404 350.7400 357.0725 377.4137 421.7293 425.4508 444.5337 454.8566 511.4724 538.1400 553.7790 599.1691 607.4229 623.9279 633.2992 639.4412 705.7328 724.2653 728.0578 757.1903 874.8000 890.2268 933.3765 955.6256 1040.7080 1043.9473 1052.8930 1077.9036 1082.2116 1113.9302 1227.8712 1231.5082 1358.2528 1368.1691 1383.2973 1408.9194 1421.7632 1439.3149 1458.1559 1460.9373 1465.7015 1468.5373 1480.6248 1598.2786 1610.7786 1619.6628 1633.2582 3000.3927 3087.2748 3122.7540
redmass: 16.4650 12.0005 10.0522 1.0281 10.7188 10.6681 18.2793 17.9259 7.8283 13.3766 12.2887 10.2986 12.9471 16.8802 18.5171 9.2430 3.9911 13.1024 15.5010 16.9654 15.6701 11.6870 8.4299 12.3990 12.5949 12.6187 15.6621 14.3659 13.5665 13.0437 13.5892 13.3705 9.1832 11.7428 10.2960 11.8682 12.1366 9.9600 6.3965 10.7174 9.8177 10.5236 9.2667 6.6716 13.3778 11.0677 3.1866 1.6069 5.6648 12.5956 3.2562 12.2267 10.2222 12.6299 11.7660 9.0642 6.0319 2.0778 3.0762 3.3349 5.1109 8.9483 2.4971 1.6388 1.6290 9.0261 11.6729 11.8563 11.5912 1.0398 1.0940 1.1009
irintensity: 0.0121 0.2726 0.1590 0.3614 0.6359 0.7444 0.0081 0.0633 1.2413 0.3874 0.1815 2.0226 2.5927 3.0651 0.8000 3.1289 1.2966 0.3224 1.4701 2.8391 2.7588 4.1955 1.5515 2.8368 0.4859 0.4731 0.0554 0.1640 0.2908 0.3083 0.5904 0.5132 3.3439 2.6073 12.9443 0.1187 0.0466 1.0911 0.4635 0.6562 0.1975 3.0323 10.0482 107.6949 165.7033 255.3953 35.0150 5.9312 40.4808 1.3816 27.8452 175.0094 9.3035 23.2381 2.9441 1.1308 0.1657 8.3174 28.4174 112.9140 63.0918 502.4782 88.1235 127.5105 152.3528 2.7635 0.1214 16.6410 8.1851 8.6180 7.6663 2.6678
temp: 298.150 k
press: 1.00000 atm
elementType: 9 9 9 9 9 9 9 9 9 8 6 6 6 6 6 6 6 6 6 6 6 6 6 1 1 1
symmnumber: 1
zpe: 350941.6 jmol-1
zpe.correction: 0.133667 hartree
zpe.thermalcorrener: 0.154625 hartree
zpe.thermalcorrenthalpy: 0.155569 hartree
zpe.thermalcorrgfe: 0.082294 hartree
zpe.sumelectzpe: -1469.253541 hartree
zpe.sumelectthermal: -1469.232583 hartree
zpe.sumelectthermalent: -1469.231638 hartree
zpe.sumelectthermalfe: -1469.304914 hartree
dipole: -2.8707 -0.9642 -0.2409
dipole: 3.0378
quadrupole: -121.5795 -134.7812 -131.0947
quadrupole: 6.8162 5.8922 -0.2837
quadrupole: 7.5723 -5.6294 -1.9429 6.8162 5.8922 -0.2837
hfenergy: -1469.3872077 hartree
pointgroup: C01 [X(C13H3F9O1)]
dipole: -1.1201245 0.1012737 -0.4043452 debye
dipolederiv: -0.1774077 0.0495302 -0.0863386 0.0112822 -0.4044885 0.4165486 -0.0503496 0.4026054 -0.6083467 -0.6719875 -0.2990326 0.1556285 -0.2741487 -0.3431649 0.167792 0.1453453 0.1865203 -0.2092844 -0.7048391 -0.3150063 0.2160531 -0.3747286 -0.3557113 0.1903623 0.2217504 0.1860349 -0.2657055 -0.2286667 0.036878 -0.0697315 0.1067756 -0.4242812 0.3868121 -0.1666768 0.4029164 -0.6027097 -0.6097759 -0.2763916 -0.188135 -0.2421975 -0.3275332 -0.1852679 -0.1595049 -0.1998556 -0.2326567 -0.1659197 0.0518412 0.0871721 -0.0017686 -0.3695896 -0.3958174 0.0283541 -0.3829143 -0.6064967 -0.7065855 -0.304889 -0.2411244 -0.3816721 -0.3066943 -0.1976934 -0.2636455 -0.1894142 -0.2544325 -0.2147554 0.0599506 0.0989917 0.1446129 -0.3732299 -0.3838073 0.2175887 -0.4032306 -0.6035442 -0.9630956 0.0434389 0.2760032 0.0459275 -0.1075986 -0.0508577 0.36165 -0.0613407 -0.2434667 -2.1278795 0.1050031 -0.0499582 -0.2907001 -0.1617291 -0.002782 -0.0381928 0.0068264 -0.2697326 1.3849145 -0.1201879 0.2448003 0.0866766 0.0868786 -0.0003937 0.6368255 -0.0265101 0.1088325 0.1557961 -0.0723486 0.1439278 -0.0913691 -0.12638 0.0558497 0.1006837 0.0671196 -0.0931166 1.4550019 -0.13686 -0.2064696 0.0762869 0.0748476 -0.0217838 -0.6341701 -0.0045219 0.0522292 -0.0799041 -0.08688 0.1095108 0.005312 0.4229184 -0.4563962 0.0254797 -0.4661788 0.6784399 0.4787749 0.3802995 -0.2319808 0.3221427 0.2884214 -0.1458389 -0.2995423 -0.1354779 0.1268601 0.7474549 0.4005462 -0.2977065 0.4235176 0.3506812 -0.2184403 -0.2519632 -0.2071324 0.231965 0.1696159 -0.0492182 0.0780237 -0.1181294 0.4461785 -0.4516264 0.1319515 -0.4712906 0.647256 0.4372372 0.3538617 0.2429622 0.3174235 0.297136 0.1736921 0.3595629 0.1717705 0.1861741 -0.0838317 -0.0670289 -0.1041232 -0.0026599 0.4059514 0.4578138 -0.0353794 0.4520664 0.7088941 -0.1215104 0.0095302 -0.0557699 0.0716687 0.0390726 0.0475786 0.0006663 0.0253184 0.0357444 0.7753279 0.3847587 0.3250151 0.4579733 0.3188545 0.1929103 0.3298252 0.1850498 0.2144456 0.1437852 -0.0854966 -0.1075492 -0.2033506 0.4094781 0.4380869 -0.224993 0.451041 0.6804031 0.9930695 -0.0743633 -0.3577544 -0.0657829 0.0443628 0.0022274 -0.4054014 0.0122658 0.2032856 -0.0120904 0.0640054 -0.0027555 0.0873742 0.0148807 -0.0624902 0.0112264 -0.0746891 0.0606166 0.0763553 -0.0062522 0.0410774 -0.0155289 0.1184863 0.0423654 -0.0273219 0.0277926 -0.0527409 0.0509158 -0.0456888 -0.0197691 -0.0949372 -0.0177475 0.001156 -0.0137689 0.0452287 0.107087 unknown
polarizability: 224.1959178|11.8332695|105.4614045|5.3071459|0.3440915|126.4968406 unknown
InChI: InChI=1S/C13H3F9O/c1-2-3(14)8(19)12(9(20)4(2)15)23-13-10(21)6(17)5(16)7(18)11(13)22/h1H3
charge 0 multiplicity 1
26 atoms
F  -2.105318 -1.523108 2.167949
F  -0.322754 1.683707 -0.996594
F  -4.595062 -1.301111 0.986127
F  -2.807154 1.864857 -2.206467
F  0.460428 -1.641654 -1.035839
F  2.135112 1.457184 2.292521
F  4.68062 1.263316 1.187209
F  2.997176 -1.790548 -2.16868
F  5.121046 -0.347367 -1.054254
O  0.032131 -0.010095 1.310315
C  -1.177238 0.065481 0.593728
C  -3.769805 0.287636 -0.640878
C  1.259069 -0.073345 0.633589
C  -2.275753 -0.670962 1.085745
C  -1.386961 0.922945 -0.50757
C  -3.536444 -0.548767 0.471604
C  -2.654715 1.014058 -1.108646
C  1.503013 -0.897445 -0.48822
C  2.342363 0.643082 1.190949
C  -5.132588 0.403877 -1.284779
C  3.631251 0.548112 0.63221
C  2.785159 -0.985216 -1.060427
C  3.854601 -0.26174 -0.498608
H  -5.724424 1.208122 -0.809605
H  -5.04027 0.646191 -2.355208
H  -5.697983 -0.534909 -1.17487
