program: Gaussian 09
title: 000297542
version: EM64L-G09RevD.01
frameworkgroup: C1[X(C14H9F5N2)]
method: RPBEPBE
basis: SDD
operation: Freq
keyword: #p
keyword: freq=noraman
keyword: PBEPBE/SDD
title: #p freq=noraman PBEPBE/SDD
converged: YES YES NO NO
title: Mulliken charges:
elementType: F F F F F N N C C C C C C C C C C C C C C H H H H H H H H H
charge: -0.181133 -0.145699 -0.150223 -0.149669 -0.145685 -0.450026 -0.020365 0.297005 0.324043 0.082616 0.033282 0.125448 0.139349 0.145135 0.070213 -0.370922 -0.353062 -0.806395 -0.242166 -0.227895 -0.234502 0.334337 0.210972 0.285828 0.257399 0.249047 0.234252 0.226809 0.230532 0.231474
chargesum: 0.00000
title: Mulliken charges with hydrogens summed into heavy atoms:
elementType: F F F F F N N C C C C C C C C C C C C C C
charge: -0.181133 -0.145699 -0.150223 -0.149669 -0.145685 -0.115689 -0.020365 0.297005 0.324043 0.082616 0.033282 0.125448 0.139349 0.145135 0.070213 -0.159950 -0.067233 -0.065697 -0.015356 0.002637 -0.003028
polarizability: 3.51146376e+02 -1.57068404e+00 1.82190089e+02 -2.43964512e+00 -7.36797238e-01 7.05390121e+01
1716.lowfreq: -6.0478 -2.8598 0.0005 0.0005 0.0010 3.5528 13.1901 30.3636 44.0726
frequency: 13.0597 30.3287 44.0665 50.1103 91.9520 97.7786 120.9107 141.6545 151.2451 171.3030 199.7225 208.8252 251.9019 263.6680 288.5938 294.1679 303.8925 318.3234 345.7888 356.0988 382.1760 402.5280 424.1680 442.3628 449.9185 490.9022 528.7814 547.5773 559.0458 591.6342 608.9438 615.1864 616.7430 666.3558 695.9209 716.3031 729.4884 774.1459 784.2520 850.9422 898.1590 929.2571 956.0433 972.8402 983.3462 987.0496 1007.4793 1022.2637 1027.6322 1057.6849 1065.4344 1084.6115 1098.9575 1154.5001 1174.6021 1195.4827 1240.6964 1315.8061 1324.3552 1355.5050 1381.7301 1391.3594 1431.6562 1436.9042 1439.7109 1461.1896 1481.1264 1488.3636 1494.5418 1530.4063 1556.8057 1585.7042 1602.6545 1611.5264 1640.4790 2962.9821 3031.0252 3124.9968 3128.0213 3136.4790 3149.0584 3162.0532 3172.8896 3436.5261
redmass: 6.8223 4.1826 7.5643 3.2472 1.3459 5.7819 16.6815 6.8942 6.4216 11.4398 6.5297 9.8808 18.3624 18.4086 13.2784 5.2880 3.6099 12.8245 8.2763 11.7215 4.9358 2.8592 12.6959 6.7872 3.4093 5.7963 10.5146 2.2945 6.5957 5.6031 2.5012 6.2963 4.6714 6.1890 1.7653 11.6951 6.6947 1.8156 4.7997 1.2564 9.0422 1.4171 5.6494 3.9743 1.4354 4.9155 1.3355 2.5024 1.5810 7.4232 2.5278 2.8849 2.3954 5.5584 1.0535 1.1282 8.1958 1.5604 2.8159 7.3713 6.1419 1.2637 2.6911 4.9622 3.3590 1.3478 1.5585 2.6386 1.9557 2.9850 3.6655 6.0396 6.7696 6.1346 9.7641 1.0421 1.0975 1.0903 1.0868 1.0880 1.0929 1.0967 1.0991 1.0741
irintensity: 0.3332 0.0317 0.1754 0.4192 4.5943 0.9373 0.0952 1.0238 3.4709 0.8397 0.0087 1.6894 0.0582 0.1467 1.7250 2.6612 0.3685 5.2239 1.1161 0.2326 4.1184 0.1798 0.8505 1.4979 3.1792 1.6127 23.6938 53.0923 1.8289 6.6857 28.0796 2.0982 6.6470 17.6519 49.8886 1.3755 17.1701 58.9650 29.6911 0.5502 77.8691 4.8281 111.2374 59.7690 0.8041 0.4515 1.1193 14.6695 3.1475 9.2854 20.4460 75.1774 23.7506 134.8199 0.3485 0.9815 7.5884 6.9519 10.0516 48.7787 7.8952 28.4687 67.2734 49.5129 5.4731 87.1768 76.0724 79.3176 318.2198 60.3229 171.7040 5.6023 14.1443 0.0772 236.5355 15.6331 14.9581 11.4382 1.9336 2.7280 34.5494 26.5857 17.8699 24.7626
temp: 298.150 k
press: 1.00000 atm
elementType: 9 9 9 9 9 7 7 6 6 6 6 6 6 6 6 6 6 6 6 6 6 1 1 1 1 1 1 1 1 1
symmnumber: 1
zpe: 528215.1 jmol-1
zpe.correction: 0.201186 hartree
zpe.thermalcorrener: 0.220262 hartree
zpe.thermalcorrenthalpy: 0.221207 hartree
zpe.thermalcorrgfe: 0.151585 hartree
zpe.sumelectzpe: -1146.039471 hartree
zpe.sumelectthermal: -1146.020395 hartree
zpe.sumelectthermalent: -1146.019451 hartree
zpe.sumelectthermalfe: -1146.089072 hartree
dipole: 4.1668 3.2810 0.2288
dipole: 5.3084
quadrupole: -122.1908 -115.1615 -119.7475
quadrupole: 2.7923 -1.2569 0.6180
quadrupole: -3.1576 3.8718 -0.7142 2.7923 -1.2569 0.6180
hfenergy: -1146.2406579 hartree
pointgroup: C01 [X(C14H9F5N2)]
dipole: -1.6093741 -1.3305195 -0.0384361 debye
polarizability: 351.0648358|1.9574821|181.2432072|5.0200041|10.3706461|71.5674342 unknown
InChI: InChI=1S/C14H9F5N2/c1-7(8-5-3-2-4-6-8)20-21-14-12(18)10(16)9(15)11(17)13(14)19/h2-6,21H,1H3
charge 0 multiplicity 1
30 atoms
F  2.454466 -2.575528 -0.224952
F  0.522381 1.862655 0.385083
F  3.016547 2.932317 0.373855
F  5.005241 -1.442873 -0.199187
F  5.301077 1.342832 0.09398
N  0.202512 -1.098391 0.037828
N  -1.005013 -0.422357 0.021801
C  1.413526 -0.414066 0.058632
C  -3.387842 -0.362021 -0.00738
C  -2.121441 -1.141668 0.024364
C  2.603647 -1.185239 -0.074529
C  1.591738 0.989852 0.214482
C  2.883252 1.557536 0.219928
C  3.888031 -0.628911 -0.062326
C  4.037375 0.76463 0.083034
C  -4.648883 -0.983159 -0.226495
C  -3.354886 1.053645 0.175328
C  -2.115738 -2.662217 0.058699
C  -5.836724 -0.21892 -0.257689
C  -4.539801 1.811004 0.145491
C  -5.790441 1.179896 -0.069487
H  0.253969 -2.122791 -0.027562
H  -4.719056 -2.063428 -0.391684
H  -2.385859 1.534218 0.338661
H  -3.116579 -3.072717 0.247694
H  -1.75373 -3.093406 -0.896674
H  -1.460666 -3.039943 0.869575
H  -6.796371 -0.718108 -0.431918
H  -4.49281 2.895711 0.292823
H  -6.712526 1.771146 -0.090276
