program: Gaussian 09
title: 000297516
version: EM64L-G09RevD.01
frameworkgroup: C1[X(C12H18BrFSi)]
method: RPBEPBE
basis: SDD
operation: Freq
keyword: #p
keyword: freq=noraman
keyword: PBEPBE/SDD
title: #p freq=noraman PBEPBE/SDD
converged: NO YES NO NO
title: Mulliken charges:
elementType: Br Si F C C C C C C C C C C C C H H H H H H H H H H H H H H H H H H
charge: 0.008321 1.423310 -0.448851 -0.492929 -0.503973 -0.257573 -0.677949 -0.701018 -0.672649 -0.680729 -0.300698 -0.289623 -0.192012 -0.187603 -0.206888 0.246754 0.234103 0.215737 0.221758 0.238944 0.228746 0.228583 0.216818 0.213726 0.233843 0.229739 0.218192 0.232978 0.214716 0.232138 0.267259 0.253074 0.253755
chargesum: 0.00000
title: Mulliken charges with hydrogens summed into heavy atoms:
elementType: Br Si F C C C C C C C C C C C C
charge: 0.008321 1.423310 -0.448851 -0.246174 -0.269869 -0.257573 -0.001510 -0.026872 0.004659 -0.014843 -0.068560 -0.022365 0.061062 0.066152 -0.206888
polarizability: 2.36744825e+02 3.16248846e-01 1.26096732e+02 -3.22292726e+00 2.53990277e+00 1.41473588e+02
1716.lowfreq: -6.6725 -0.0019 -0.0015 -0.0014 2.1190 7.6642 28.2212 31.4432 41.9726
frequency: 27.0266 30.7430 41.8968 42.8376 71.8389 90.1925 105.6544 133.7310 160.4321 188.6267 206.7003 208.0022 210.5228 228.5426 241.6955 256.4462 260.6057 283.0334 311.7982 349.1072 373.4067 395.3306 399.4649 418.3161 481.1755 508.0874 607.5559 620.2496 665.1019 713.4641 720.0340 744.0249 820.8108 844.5141 883.0883 885.8621 915.3664 918.9949 956.8584 969.1111 970.6916 981.4462 992.9554 1021.7472 1029.2660 1055.6953 1084.2700 1097.8024 1105.0404 1106.5272 1166.2434 1167.6879 1196.5670 1245.2812 1255.4384 1278.7116 1287.4976 1296.3492 1338.9256 1375.0562 1379.7465 1382.2608 1398.2337 1400.9761 1460.8035 1468.1103 1468.8207 1473.9194 1475.7271 1485.1997 1486.1924 1487.1477 1489.3263 1561.2540 1574.6350 2955.1351 2961.9934 2967.7058 2968.2021 2971.9683 2975.3586 3053.8103 3056.1659 3058.0148 3059.2859 3063.0774 3068.9655 3075.8330 3076.8580 3114.3310 3138.8026 3165.1815 3169.4936
redmass: 3.0322 3.8376 2.6278 3.5423 4.7653 3.2753 5.7020 5.8664 4.6525 4.6306 1.1046 1.6414 1.7226 1.2884 1.3790 2.0970 3.0195 4.0490 4.0281 4.7587 2.8557 2.7293 2.5302 3.9819 4.0434 3.2270 4.7144 7.1224 4.5876 6.5433 4.2335 10.9356 1.4024 1.2608 2.5681 2.5160 1.1499 1.1551 1.3234 1.3362 1.3576 1.3603 5.4871 1.2322 1.2829 3.6545 2.9687 2.8551 2.6123 1.4932 1.8827 1.8878 1.1292 1.4551 1.4620 1.3106 1.3114 1.2585 4.0751 3.3543 1.2060 1.1805 1.1901 1.1888 2.0953 1.0439 1.0469 1.0487 1.0484 1.0446 1.0430 1.0475 1.0472 7.1040 5.9026 1.0792 1.0355 1.0360 1.0364 1.0366 1.0804 1.0998 1.0996 1.0997 1.0992 1.0992 1.1002 1.0994 1.0996 1.0897 1.0895 1.0949 1.0962
irintensity: 0.0690 0.0037 0.0048 0.1503 0.6279 0.0154 0.0172 2.6106 6.4345 0.0788 0.1397 2.3598 3.7642 0.5308 0.9513 1.0133 1.5714 2.5786 6.8435 15.1488 8.3643 1.0455 1.8732 2.1766 11.9978 53.7093 37.7295 1.6287 65.7116 103.7031 14.8836 72.8812 40.6188 5.0612 5.1198 39.4870 8.8829 7.1078 0.1230 0.4385 0.0765 0.0103 64.5814 14.7183 22.4127 51.5120 2.2235 2.2077 12.2453 2.8579 1.0852 3.6533 0.6820 7.5425 10.5603 0.8357 0.8992 1.5872 6.0477 7.1032 14.5718 15.9391 13.2693 6.1731 45.1086 0.2283 0.8457 6.3418 8.9931 19.8965 22.9493 14.6862 2.1766 2.2151 63.2109 17.0929 36.0417 44.3526 37.0250 30.7983 18.3783 15.8926 41.3762 24.8854 67.4253 50.3007 25.2153 19.7842 41.7128 12.6414 0.7064 7.3073 2.4532
temp: 298.150 k
press: 1.00000 atm
elementType: 35 14 9 6 6 6 6 6 6 6 6 6 6 6 6 1 1 1 1 1 1 1 1 1 1 1 1 1 1 1 1 1 1
symmnumber: 1
zpe: 701226.9 jmol-1
zpe.correction: 0.267083 hartree
zpe.thermalcorrener: 0.285766 hartree
zpe.thermalcorrenthalpy: 0.286710 hartree
zpe.thermalcorrgfe: 0.217893 hartree
zpe.sumelectzpe: -869.678852 hartree
zpe.sumelectthermal: -869.660169 hartree
zpe.sumelectthermalent: -869.659225 hartree
zpe.sumelectthermalfe: -869.728043 hartree
dipole: 1.8677 0.3756 -2.3104
dipole: 2.9945
quadrupole: -111.4999 -108.3554 -106.3336
quadrupole: 0.8008 -7.3863 1.4073
quadrupole: -2.7702 0.3742 2.3960 0.8008 -7.3863 1.4073
hfenergy: -869.9459355 hartree
pointgroup: C01 [X(C12H18Br1F1Si1)]
dipole: 0.7471046 -0.0137325 0.9108595 debye
polarizability: 236.7816894|-1.9228986|127.3436614|2.0180029|4.8195528|140.1897941 unknown
InChI: InChI=1S/C12H18BrFSi/c1-9(2)15(14,10(3)4)12-7-5-11(13)6-8-12/h5-10H,1-4H3
charge 0 multiplicity 1
33 atoms
Br -5.273834 0.206064 0.203723
Si 1.406878 -0.061827 -0.285525
F  1.701299 -0.132569 -1.998577
C  2.115007 -1.694213 0.433744
C  2.266769 1.528954 0.352726
C  -0.488812 0.034885 -0.141376
C  1.468819 -2.931477 -0.241733
C  1.95466 -1.744273 1.977143
C  1.761431 2.780707 -0.414337
C  3.812506 1.411415 0.274822
C  -1.124673 0.330956 1.095559
C  -1.312051 -0.203522 -1.2750
C  -2.533497 0.383728 1.207846
C  -2.722628 -0.153678 -1.185666
C  -3.314043 0.137115 0.06028
H  3.199222 -1.696073 0.193761
H  1.978831 1.639442 1.420909
H  1.923226 -3.864166 0.144663
H  0.382527 -2.976923 -0.036263
H  1.607247 -2.914901 -1.338034
H  2.386401 -2.681892 2.376238
H  0.887044 -1.726319 2.269463
H  2.464595 -0.902383 2.483789
H  2.242128 3.695081 -0.016641
H  2.009054 2.710192 -1.489708
H  0.66658 2.907052 -0.327739
H  4.286984 2.338499 0.649654
H  4.145647 1.265497 -0.76973
H  4.20128 0.569016 0.87732
H  -0.530338 0.532516 1.996151
H  -0.848892 -0.420532 -2.244212
H  -3.007713 0.613284 2.166395
H  -3.342555 -0.336857 -2.068145
