program: Gaussian 09
title: 000297540
version: EM64L-G09RevD.01
frameworkgroup: C1[X(C18H12Br3FSi)]
method: RPBEPBE
basis: SDD
operation: Freq
keyword: #p
keyword: freq=noraman
keyword: PBEPBE/SDD
title: #p freq=noraman PBEPBE/SDD
converged: YES YES NO NO
title: Mulliken charges:
elementType: Br Br Br Si F C C C C C C C C C C C C C C C C C C H H H H H H H H H H H H
charge: 0.022602 0.022635 0.022483 1.507885 -0.421952 -0.272886 -0.269170 -0.272347 -0.279765 -0.271860 -0.278746 -0.269951 -0.279901 -0.271069 -0.188712 -0.190523 -0.188632 -0.190107 -0.188648 -0.190355 -0.208810 -0.208573 -0.208699 0.256453 0.253601 0.256412 0.254188 0.256654 0.254122 0.257127 0.257503 0.257069 0.257420 0.257086 0.257466
chargesum: 0.00000
title: Mulliken charges with hydrogens summed into heavy atoms:
elementType: Br Br Br Si F C C C C C C C C C C C C C C C C C C
charge: 0.022602 0.022635 0.022483 1.507885 -0.421952 -0.272886 -0.269170 -0.272347 -0.023313 -0.018259 -0.022334 -0.015763 -0.023247 -0.016947 0.068414 0.066981 0.068436 0.067313 0.068438 0.067112 -0.208810 -0.208573 -0.208699
polarizability: 3.24605987e+02 -1.68625047e-01 3.24572369e+02 2.43953775e-01 2.41607310e-01 1.66105868e+02
1716.lowfreq: -8.9204 -4.8559 -2.0967 -0.0007 -0.0007 -0.0003 4.0867 6.5700 17.9987
frequency: -8.5393 3.2698 17.9913 18.7575 22.1170 32.0808 73.4187 74.0958 88.8540 131.2636 132.3886 132.8033 173.7084 174.2096 194.2278 245.7667 245.9363 264.0814 289.5970 290.5241 339.9968 340.2761 350.2085 393.7044 394.1386 394.7924 398.7338 485.4340 486.2355 500.2648 543.4833 543.8222 619.9948 621.6942 622.2609 688.1834 712.2895 712.5039 712.8218 725.3347 725.4934 752.0908 820.3878 821.2912 822.2676 837.1669 837.9584 842.8244 957.1136 958.5599 959.7255 971.9827 972.8195 976.4461 993.9120 994.0221 995.1598 1055.2943 1056.6751 1057.0221 1099.5217 1107.5707 1108.1414 1108.2946 1113.0707 1113.7642 1197.0929 1198.1266 1200.1010 1297.1382 1298.6872 1299.3011 1339.3170 1342.8074 1343.5403 1377.9224 1378.5251 1379.0281 1462.2173 1463.2745 1463.9561 1560.3576 1561.5519 1561.8541 1576.4061 1577.3222 1577.6285 3129.0037 3129.3565 3129.6250 3131.3805 3131.9869 3132.3261 3168.0224 3168.5428 3168.6014 3171.1315 3171.3561 3171.5409
redmass: 3.7213 3.7320 24.6467 25.2858 13.7577 3.9042 9.7447 9.6891 8.6082 10.5200 11.2708 13.6986 12.2939 12.1634 9.9894 8.0136 8.0643 5.3196 5.7530 5.6942 7.1967 7.1869 7.0050 4.5082 3.4299 2.8188 3.2093 3.8119 3.8251 3.3180 7.4746 7.4255 7.1353 7.1499 7.1484 7.7438 4.4873 4.5003 4.5501 6.1088 6.0502 11.1776 1.4460 1.4201 1.4155 1.2512 1.2507 1.2494 1.3250 1.3199 1.3193 1.3850 1.3834 1.3761 5.5777 5.5862 5.7438 4.1951 3.5761 3.6153 2.3924 1.6253 1.6071 1.5512 2.3511 2.3725 1.1299 1.1307 1.1270 1.2602 1.2563 1.2555 3.9377 4.2391 4.2853 3.6474 3.5200 3.5201 2.1044 2.1171 2.1231 7.0084 7.0712 7.0892 5.9348 5.8078 5.8288 1.0898 1.0900 1.0899 1.0902 1.0902 1.0902 1.0950 1.0949 1.0949 1.0961 1.0961 1.0962
irintensity: 0.0272 0.0299 0.0328 0.0388 0.1447 0.0641 1.4415 1.3255 0.0531 3.1543 2.5285 0.7894 2.1379 2.1126 0.0254 6.9787 6.9105 0.1089 4.8778 4.7581 36.4730 36.4944 0.4413 1.4000 0.5829 0.1174 0.0146 4.7721 4.1611 45.9087 93.2700 94.9394 1.3188 0.4180 0.4119 0.6379 16.8116 17.3579 18.3399 147.0395 141.7563 113.2442 55.3215 23.9545 26.3355 0.0034 0.0516 0.7451 0.8892 0.3069 0.2613 1.0240 1.0623 0.1883 99.4058 99.1292 5.5435 11.4664 87.1013 87.1026 2.9642 5.5502 4.2343 2.9420 35.0367 36.0311 7.4611 8.1007 0.4300 1.5812 0.6012 0.3437 6.9969 13.0255 12.9244 13.9054 11.1855 11.2932 10.1061 64.4483 63.9980 3.3162 17.6644 18.5065 21.5226 115.7342 114.5973 5.9888 7.7930 8.0803 1.6265 2.0561 1.8084 6.1477 6.6270 6.1083 2.0504 2.0216 0.5045
temp: 298.150 k
press: 1.00000 atm
elementType: 35 35 35 14 9 6 6 6 6 6 6 6 6 6 6 6 6 6 6 6 6 6 6 1 1 1 1 1 1 1 1 1 1 1 1
symmnumber: 1
zpe: 631083.2 jmol-1
zpe.correction: 0.240367 hartree
zpe.thermalcorrener: 0.261979 hartree
zpe.thermalcorrenthalpy: 0.262923 hartree
zpe.thermalcorrgfe: 0.181395 hartree
zpe.sumelectzpe: -1121.202938 hartree
zpe.sumelectthermal: -1121.181326 hartree
zpe.sumelectthermalent: -1121.180382 hartree
zpe.sumelectthermalfe: -1121.261911 hartree
dipole: -0.0065 -0.0024 -1.2955
dipole: 1.2956
quadrupole: -173.6618 -173.3037 -173.2566
quadrupole: -0.0332 0.1065 0.0795
quadrupole: -0.2544 0.1037 0.1508 -0.0332 0.1065 0.0795
hfenergy: -1121.4433052 hartree
pointgroup: C01 [X(C18H12Br3F1Si1)]
dipole: 0.0041096 -0.0004691 0.5096928 debye
polarizability: 324.4289599|0.0535514|324.7491542|-0.1277339|0.3742731|166.1061095 unknown
InChI: InChI=1S/C18H12Br3FSi/c19-13-1-7-16(8-2-13)23(22,17-9-3-14(20)4-10-17)18-11-5-15(21)6-12-18/h1-12H
charge 0 multiplicity 1
35 atoms
Br 0.472294 -6.405631 0.946869
Br 5.310415 3.623206 0.95905
Br -5.787871 2.771234 0.990599
Si 0.001285 0.005476 -0.893871
F  -0.004311 0.010361 -2.628146
C  0.154477 -1.807156 -0.369022
C  1.493933 1.042334 -0.363051
C  -1.643685 0.77363 -0.356805
C  1.097941 -2.221693 0.608473
C  2.777391 0.785035 -0.919832
C  -2.465822 0.155269 0.622636
C  -0.692256 -2.79236 -0.948592
C  1.371487 2.085787 0.592614
C  -2.084056 1.998894 -0.930015
C  1.197789 -3.575364 1.005347
C  3.907356 1.542211 -0.538938
C  -3.689046 0.737321 1.028616
C  -0.604324 -4.150334 -0.569708
C  2.491547 2.851792 0.990981
C  -3.3052 2.593476 -0.541863
C  0.341875 -4.522734 0.40824
C  3.747152 2.567034 0.417398
C  -4.091454 1.952473 0.438584
H  1.771822 -1.490577 1.071217
H  2.905252 -0.004969 -1.669521
H  -2.162018 -0.794466 1.079178
H  -1.42368 -2.509527 -1.714998
H  0.395378 2.316203 1.036119
H  -1.481635 2.49593 -1.69971
H  1.928786 -3.880649 1.759431
H  4.887501 1.338052 -0.979044
H  -4.312206 0.250644 1.784253
H  -1.25711 -4.898771 -1.027745
H  2.383417 3.652499 1.72813
H  -3.635129 3.532269 -0.995577
