program: Gaussian 09
title: 000297499
version: EM64L-G09RevD.01
frameworkgroup: C1[X(C7H12N2O3)]
method: RPBEPBE
basis: SDD
operation: Freq
keyword: #p
keyword: freq=noraman
keyword: PBEPBE/SDD
title: #p freq=noraman PBEPBE/SDD
converged: YES YES NO NO
title: Mulliken charges:
elementType: O O O N N C C C C C C C H H H H H H H H H H H H
charge: -0.230157 -0.265623 -0.191713 0.110131 -0.367026 -0.253124 -0.013144 0.219368 -0.667640 -0.793604 0.254013 -0.789546 0.229103 0.229741 0.216731 0.247323 0.234757 0.232783 0.301073 0.233540 0.313660 0.271856 0.238529 0.238969
chargesum: 0.00000
title: Mulliken charges with hydrogens summed into heavy atoms:
elementType: O O O N N C C C C C C C
charge: -0.230157 -0.265623 -0.191713 0.110131 -0.053365 0.205720 -0.013144 0.219368 0.031171 -0.026209 0.254013 -0.040192
polarizability: 1.61737948e+02 1.03447294e+01 1.11831916e+02 -2.18280164e+00 2.97127108e+00 6.44866951e+01
1716.lowfreq: -75.5008 -13.3537 -6.4012 -0.0011 -0.0011 -0.0007 4.2507 31.6525 51.8994
frequency: -75.4929 31.4629 51.8948 73.0375 85.2795 92.5423 117.4761 177.2392 182.8048 224.0072 273.8558 276.2573 303.2137 360.0825 373.4670 449.2041 479.5452 501.1306 572.4597 603.0801 651.7390 666.6461 713.8174 765.5414 818.6876 838.2658 925.3666 946.5060 987.1959 1012.9904 1031.0102 1034.6398 1093.8766 1108.2569 1126.3003 1155.6027 1192.5326 1278.5775 1299.7034 1358.9841 1375.0687 1383.5032 1388.3370 1435.6573 1454.0454 1455.8601 1461.6034 1466.8540 1484.8736 1489.0782 1499.1693 1557.5689 1585.9318 1670.0406 2963.3670 2988.8896 2993.3207 3029.4692 3035.8609 3074.4942 3088.8113 3095.4956 3116.7634 3121.4013 3137.2153 3385.4272
redmass: 1.0435 3.8872 3.6317 5.5617 3.4474 3.7075 4.7814 1.0983 2.0411 1.5490 3.8954 4.3081 2.8194 4.3722 3.9642 3.2121 2.5183 5.1340 3.0449 5.1767 1.4950 3.7926 6.3615 2.3279 1.6263 3.3441 2.2729 2.4516 2.4375 2.6333 1.6822 1.5350 2.1857 4.5168 5.2838 1.7026 3.0915 1.1182 2.9709 1.3745 1.2340 1.2556 1.2339 1.1589 1.0699 1.0992 1.0441 1.0471 1.0522 1.0471 1.4323 9.3691 8.7689 7.5556 1.0397 1.0382 1.0360 1.0601 1.0977 1.0983 1.0975 1.1024 1.0948 1.1060 1.0980 1.0749
irintensity: 0.0220 6.1714 10.8129 2.5114 1.4662 3.7404 0.0461 0.4875 0.9782 1.6468 0.4805 1.0085 8.7596 14.4668 2.5709 1.8506 24.7949 10.3731 2.2427 8.1152 58.0815 7.3953 20.0813 16.3444 4.2589 2.2440 6.1247 19.1495 25.4773 65.1147 7.8693 0.3345 75.3278 318.3154 135.9256 47.9731 469.3553 6.1201 83.1484 19.3115 50.2444 77.8804 22.3770 157.7138 2.2466 26.5133 14.9776 20.5460 15.8567 21.8382 84.0443 98.5161 144.5295 196.9302 16.1549 6.0987 20.3576 31.9042 18.7037 14.5558 36.2944 2.0060 1.0226 27.6303 7.9934 5.0918
temp: 298.150 k
press: 1.00000 atm
elementType: 8 8 8 7 7 6 6 6 6 6 6 6 1 1 1 1 1 1 1 1 1 1 1 1
symmnumber: 1
zpe: 496285.1 jmol-1
zpe.correction: 0.189025 hartree
zpe.thermalcorrener: 0.202393 hartree
zpe.thermalcorrenthalpy: 0.203338 hartree
zpe.thermalcorrgfe: 0.147686 hartree
zpe.sumelectzpe: -608.155205 hartree
zpe.sumelectthermal: -608.141837 hartree
zpe.sumelectthermalent: -608.140893 hartree
zpe.sumelectthermalfe: -608.196545 hartree
dipole: -1.8956 3.4726 0.7056
dipole: 4.0187
quadrupole: -55.9087 -76.5178 -70.0193
quadrupole: -19.5152 -2.2904 -0.0307
quadrupole: 11.5733 -9.0359 -2.5374 -19.5152 -2.2904 -0.0307
hfenergy: -608.3442303 hartree
pointgroup: C01 [X(C7H12N2O3)]
dipole: -0.8027168 1.2620824 0.5124426 debye
dipolederiv: -1.0143749 0.4199387 0.0158614 0.8680431 -0.9928935 -0.1285653 0.2778671 -0.2484898 -0.3651538 -0.9304309 -0.3240999 -0.1576524 0.0061952 -0.8114472 -0.1553171 -0.0296015 -0.2008988 -0.3895962 -0.5321818 0.0828933 0.0166139 -0.4503964 -0.9744869 -0.2817747 -0.1809422 -0.2444922 -0.4111396 1.1257278 0.3857036 0.2245461 -0.0326855 -0.3425227 -0.1033881 0.0523661 -0.0869152 -0.0869509 -1.8044369 -0.7769896 -0.398277 -0.2791642 -0.3574106 -0.032369 -0.1791381 -0.0535846 -0.3493778 0.8185289 -0.3335424 -0.0056833 -0.2631953 0.3976611 -0.0426659 -0.0218328 0.0032546 0.3337271 -0.8205976 -0.2533625 -0.1517104 -0.2918147 0.3186257 0.1142297 -0.152051 0.123283 -0.0059481 1.7774003 0.1571528 0.1653239 -0.7407775 1.2479665 0.2801739 -0.2124238 0.4207077 0.3336511 -0.0916493 0.0846345 -0.0305532 0.0521637 0.0021039 0.0617105 -0.0427993 0.036451 -0.1199915 -0.1017317 0.1124583 0.0247455 0.0104142 -0.1930055 -0.1205886 -0.0103774 -0.1152254 0.0828224 1.747761 0.355685 0.2303222 0.9717867 1.4351816 0.5355911 0.4462814 0.4855708 0.3939865 -0.4881573 0.0631001 -0.0084698 0.1878346 -0.0706238 -0.0374544 0.0409212 -0.0439929 0.0439329 0.0143276 0.036285 -0.0293846 0.0698521 -0.0039003 -0.1080705 0.0138863 -0.0875767 -0.055902 -0.0558649 0.0172675 0.0378713 -0.0938788 -0.0417986 0.098708 -0.0061414 0.0465258 0.0474953 -0.1617921 0.1058589 0.0130771 0.1123471 0.0707645 0.0070768 -0.0026623 0.0214714 0.0928536 0.1358948 0.0057135 0.0211619 -0.0118835 -0.0080229 -0.1223798 0.0143556 -0.0693419 -0.023598 0.0454743 -0.1295192 0.0416962 -0.0900756 -0.0292512 0.0664251 0.0061621 0.0466984 0.0549543 0.0221696 0.0369905 0.1380763 -0.0281954 0.0523863 0.039822 0.082081 -0.014655 -0.027808 0.0858083 -0.151678 -0.0576357 -0.0595118 0.1283725 -0.0059195 -0.0248497 -0.009907 0.123234 0.0434976 0.1141904 -0.0750271 0.0325516 0.0229575 0.0200923 -0.0729091 0.0794514 -0.0192283 0.0250112 0.0381165 -0.0010418 0.0874457 0.0679868 -0.0831096 0.0183962 -0.0867195 0.2712667 0.0221498 -0.0538194 -0.0263422 -0.1112078 0.0197793 -0.0486003 -0.0469311 -0.0452777 0.1149281 0.0681634 0.0141023 -0.0076754 0.0223269 0.1010466 -0.0615454 0.0437503 -0.0571409 -0.0891164 0.0693029 -0.0070799 0.0201571 0.0318255 -0.0394692 0.1079185 -0.0134077 0.1008034 0.0509585 unknown
polarizability: 160.3512666|8.1524206|107.2505137|12.1368207|15.1440104|70.4547786 unknown
InChI: InChI=1S/C7H12N2O3/c1-4-12-7(11)5(2)8-9-6(3)10/h9H,4H2,1-3H3
charge 0 multiplicity 1
24 atoms
O  2.021587 -0.625952 -0.856114
O  2.595058 1.454396 0.034541
O  -2.574632 -1.848449 -1.491837
N  -0.574647 -0.021427 -0.71178
N  -1.919519 0.260184 -0.672169
C  3.471154 -0.995294 -0.898015
C  0.25588 0.92714 -0.310995
C  1.72367 0.626359 -0.351432
C  3.923617 -1.567823 0.448183
C  -0.1409 2.300961 0.194206
C  -2.878727 -0.706446 -1.082755
C  -4.310736 -0.184298 -0.964096
H  3.514405 -1.745762 -1.702834
H  4.057547 -0.100688 -1.172955
H  4.964777 -1.931531 0.365324
H  3.889971 -0.796102 1.235283
H  3.2840 -2.415781 0.747209
H  -0.784044 2.236184 1.094791
H  0.766386 2.862247 0.462122
H  -0.687562 2.878469 -0.578238
H  -2.264551 1.17579 -0.346534
H  -4.997487 -0.976551 -1.294156
H  -4.556172 0.086263 0.079632
H  -4.468074 0.708313 -1.597584
