program: Gaussian 09
title: 000297492
version: EM64L-G09RevD.01
frameworkgroup: C1[X(C10H12ClN3O3)]
method: RPBEPBE
basis: SDD
operation: Freq
keyword: #p
keyword: freq=noraman
keyword: PBEPBE/SDD
title: #p freq=noraman PBEPBE/SDD
converged: YES YES NO NO
title: Mulliken charges:
elementType: Cl O O O N N N C C C C C C C C C C H H H H H H H H H H H H
charge: -0.082265 -0.286178 -0.213795 -0.199495 -0.500120 -0.411111 0.018179 0.360867 0.267069 -0.476191 -0.354457 0.406497 -0.406251 -0.844030 -0.326731 0.299083 -0.551782 0.358379 0.239647 0.318521 0.286705 0.234696 0.254146 0.233771 0.247988 0.274011 0.298718 0.281851 0.272279
chargesum: 0.00000
title: Mulliken charges with hydrogens summed into heavy atoms:
elementType: Cl O O O N N N C C C C C C C C C C
charge: -0.082265 -0.286178 -0.213795 -0.199495 -0.181599 -0.112393 0.018179 0.360867 0.267069 -0.117812 -0.114810 0.406497 -0.119546 -0.121418 0.195268 0.299083 0.002348
polarizability: 2.28650074e+02 8.73066938e+00 1.78103289e+02 1.10783316e+01 -1.98917074e+00 7.55739883e+01
1716.lowfreq: -2.1741 -0.0022 -0.0005 0.0006 5.0020 5.8537 17.3637 38.8309 49.3743
frequency: 16.1543 38.7482 49.3491 58.5542 71.9672 90.8793 102.8657 116.6811 187.2678 194.1511 215.9376 224.7064 274.7257 283.2113 312.5031 347.4340 368.2909 404.6832 422.9656 447.1231 478.5332 526.6575 553.1958 581.3417 599.5025 604.4838 623.4089 701.1373 709.4736 711.4303 724.8939 753.3207 781.4867 834.2949 854.1004 918.2153 964.4818 965.8919 969.5852 988.2969 991.5220 1040.1410 1043.0452 1075.3493 1125.9341 1139.0016 1168.8079 1184.6932 1211.6789 1218.7195 1239.6684 1266.7515 1276.7320 1298.7381 1368.2550 1370.3089 1387.2952 1396.4607 1430.0924 1440.9720 1447.6595 1457.6834 1478.8422 1483.8223 1493.6535 1519.1704 1596.0173 1619.2876 1650.7478 2955.4751 2997.6792 3024.7289 3056.3494 3068.9788 3093.7557 3141.5210 3157.0824 3192.2981 3194.8752 3535.2706 3546.9359
redmass: 9.5108 7.2153 11.4788 7.3100 4.6031 7.5644 4.1717 3.5604 1.0957 8.3620 3.4681 3.5817 4.0156 5.2288 3.6864 5.7367 3.6416 1.5382 3.6157 3.0740 2.4775 5.5162 3.9547 4.2552 2.2535 2.0741 6.3390 8.0434 5.2640 6.4891 3.3491 8.4393 4.0960 1.3653 2.2459 4.3680 1.4356 2.0407 1.3416 2.5307 1.7207 1.9143 1.5442 2.0802 3.4087 1.4483 1.3930 2.2086 2.7137 2.7011 1.5067 1.5418 2.4196 1.1808 1.6017 4.6249 3.5390 1.3496 3.3783 1.1082 1.1438 2.0006 1.0460 1.3723 1.8581 2.3055 6.9640 6.3510 4.2977 1.0403 1.0600 1.0976 1.0942 1.0646 1.0946 1.0906 1.1121 1.0945 1.0928 1.0773 1.0756
irintensity: 1.0199 0.8116 1.0606 9.7265 2.8076 4.6111 0.5999 5.0599 0.5497 1.8529 0.4956 4.2507 2.6238 3.3071 4.3188 7.3805 24.7028 7.6971 1.5971 8.1815 7.1927 2.6575 24.1202 30.5971 67.7790 104.4794 12.7308 1.4794 6.2673 37.6078 0.0428 32.8124 1.4174 28.3799 16.0511 6.9285 28.9417 13.4756 8.9198 6.0571 9.4741 10.0128 7.3680 23.3652 4.4675 6.9803 10.3326 97.4815 231.4303 142.8795 246.8917 52.3177 37.7652 50.1339 47.3421 70.4581 60.1457 20.0055 122.2352 9.2001 44.6352 33.2323 16.7800 340.1205 134.0964 499.3280 38.6177 33.0726 142.3404 24.6572 50.1517 18.3276 6.1274 19.5941 13.8981 15.0824 14.6749 3.3749 28.2701 27.7527 29.8952
temp: 298.150 k
press: 1.00000 atm
elementType: 17 8 8 8 7 7 7 6 6 6 6 6 6 6 6 6 6 1 1 1 1 1 1 1 1 1 1 1 1
symmnumber: 1
zpe: 570965.2 jmol-1
zpe.correction: 0.217469 hartree
zpe.thermalcorrener: 0.234373 hartree
zpe.thermalcorrenthalpy: 0.235317 hartree
zpe.thermalcorrgfe: 0.169988 hartree
zpe.sumelectzpe: -1236.939576 hartree
zpe.sumelectthermal: -1236.922673 hartree
zpe.sumelectthermalent: -1236.921728 hartree
zpe.sumelectthermalfe: -1236.987057 hartree
dipole: 5.1698 6.1938 0.6936
dipole: 8.0976
quadrupole: -125.5722 -103.2164 -107.1069
quadrupole: -24.0137 2.1515 1.4614
quadrupole: -13.6071 8.7488 4.8583 -24.0137 2.1515 1.4614
hfenergy: -1237.1570454 hartree
pointgroup: C01 [X(C10H12Cl1N3O3)]
dipole: 1.9133635 -2.5465936 -0.0585995 debye
polarizability: 228.0081524|-11.7561883|178.3700986|-7.4997915|-8.8910618|75.9490997 unknown
InChI: InChI=1S/C10H12ClN3O3/c1-7-2-3-8(14(16)17)6-9(7)13-10(15)12-5-4-11/h2-3,6,12-13H,4-5H2,1H3
charge 0 multiplicity 1
29 atoms
Cl 5.99288 -0.688062 0.721434
O  1.397871 1.49152 -0.527463
O  -4.697343 1.565423 0.148005
O  -2.770947 2.743813 -0.16051
N  0.898727 -0.811332 -0.290915
N  3.112803 -0.093951 -0.546285
N  -3.414812 1.637646 -0.001247
C  -0.510199 -0.779521 -0.136954
C  -1.184709 -2.034697 0.037659
C  -1.246824 0.430914 -0.150932
C  -2.589841 -2.03392 0.195389
C  -2.64358 0.367249 0.012695
C  -3.342691 -0.844264 0.187048
C  -0.413691 -3.341864 0.054396
C  4.166972 0.908652 -0.709465
C  1.771909 0.283541 -0.457447
C  5.105758 0.982276 0.494531
H  -0.741737 1.388546 -0.287426
H  -3.102993 -2.992576 0.328852
H  1.318807 -1.741833 -0.288689
H  -4.42783 -0.837679 0.309039
H  0.330117 -3.376367 0.876171
H  -1.094756 -4.195015 0.202373
H  0.12408 -3.520677 -0.898968
H  4.750494 0.710452 -1.628142
H  3.660118 1.885253 -0.827292
H  3.413587 -1.06023 -0.402135
H  4.570431 1.154037 1.439068
H  5.911202 1.71687 0.34881
