program: Gaussian 09
title: 000297481
version: EM64L-G09RevD.01
frameworkgroup: C1[X(C11H8F4S)]
method: RPBEPBE
basis: SDD
operation: Freq
keyword: #p
keyword: freq=noraman
keyword: PBEPBE/SDD
title: #p freq=noraman PBEPBE/SDD
converged: YES YES NO NO
title: Mulliken charges:
elementType: S F F F F C C C C C C C C C C C H H H H H H H H
charge: 0.306697 -0.162163 -0.156111 -0.152977 -0.127147 -0.221238 -0.693161 -0.571322 0.328126 0.392501 0.284506 -0.089722 -0.381157 -0.395585 -0.227089 -0.222489 0.307022 0.315908 0.244781 0.264112 0.245237 0.246590 0.232579 0.232103
chargesum: 0.00000
title: Mulliken charges with hydrogens summed into heavy atoms:
elementType: S F F F F C C C C C C C C C C C
charge: 0.306697 -0.162163 -0.156111 -0.152977 -0.127147 0.085784 -0.377253 -0.062429 0.328126 0.392501 0.284506 -0.089722 -0.135921 -0.148995 0.005490 0.009613
polarizability: 1.65152824e+02 -4.31011057e-02 1.32407860e+02 -1.34515620e+01 -3.61153498e+00 8.55434460e+01
1716.lowfreq: -6.9506 -4.1089 0.0017 0.0017 0.0021 7.9112 35.3380 63.9022 97.3392
frequency: 35.2771 63.8935 97.3387 130.7679 187.6759 216.5041 240.7831 262.0807 266.5597 295.8190 331.4983 363.1960 398.1100 417.4058 440.6393 458.6075 471.5435 511.0065 551.0599 566.3555 598.1695 630.9432 673.6659 719.0938 750.2893 775.0452 814.3354 842.0691 860.5602 872.7577 927.3279 932.2897 950.1206 959.7781 981.7810 991.0891 1023.2389 1025.3542 1051.0656 1090.8157 1130.8853 1162.3240 1170.5222 1174.8643 1180.6928 1206.0672 1210.9605 1233.5904 1271.6433 1281.4647 1310.8093 1333.1211 1391.3041 1449.9914 1460.3995 1477.5822 1597.4545 1619.3944 3004.3043 3056.4267 3063.1424 3074.4337 3126.8339 3133.0903 3146.8156 3165.4994
redmass: 8.7657 9.1761 5.8588 5.8315 8.8693 9.5668 8.8388 8.2626 3.3398 14.0178 7.9459 9.4329 14.6736 3.3950 11.3411 3.9595 5.4916 5.8787 10.1730 5.5120 6.7578 6.0592 4.3422 3.8308 1.6705 2.7397 4.5239 4.4128 8.2315 1.4109 3.1234 2.6662 2.7365 2.2820 3.7034 1.3330 4.1782 2.4864 2.8448 2.4700 2.2438 1.5003 1.9331 1.1951 2.3733 1.4833 1.5210 1.6498 1.4790 2.3492 1.5230 1.5546 6.4729 2.4623 1.1804 2.3299 6.9828 7.0531 1.0629 1.0865 1.0987 1.0877 1.0859 1.0899 1.0948 1.1004
irintensity: 0.4404 0.3407 0.8399 0.8343 1.6916 0.8105 1.8495 0.9374 5.6216 1.5138 1.6347 0.1701 5.1279 2.8689 7.4018 5.4950 5.0302 18.3052 1.6818 1.5211 10.9878 10.4013 9.2602 5.1486 55.2327 14.7951 9.4563 32.2250 71.0186 4.5898 103.9824 62.2346 34.8925 114.6726 52.8816 0.6908 38.4940 17.7941 64.9473 7.8552 23.0407 44.7335 22.2950 1.4192 31.1503 12.0882 9.3829 3.4984 10.3575 10.9060 5.4623 17.0549 2.6903 5.2383 17.9455 9.2519 0.0827 1.6545 21.8685 6.6376 3.8038 8.4096 1.9160 3.5083 22.8827 25.2051
temp: 298.150 k
press: 1.00000 atm
elementType: 16 9 9 9 9 6 6 6 6 6 6 6 6 6 6 6 1 1 1 1 1 1 1 1
symmnumber: 1
zpe: 431908.9 jmol-1
zpe.correction: 0.164505 hartree
zpe.thermalcorrener: 0.177676 hartree
zpe.thermalcorrenthalpy: 0.178620 hartree
zpe.thermalcorrgfe: 0.124321 hartree
zpe.sumelectzpe: -1220.249089 hartree
zpe.sumelectthermal: -1220.235919 hartree
zpe.sumelectthermalent: -1220.234974 hartree
zpe.sumelectthermalfe: -1220.289274 hartree
dipole: -4.5666 0.4226 -2.6423
dipole: 5.2928
quadrupole: -100.7741 -93.1465 -98.7458
quadrupole: -0.6778 -3.7641 -1.8304
quadrupole: -3.2186 4.4090 -1.1903 -0.6778 -3.7641 -1.8304
hfenergy: -1220.4135948 hartree
pointgroup: C01 [X(C11H8F4S1)]
dipole: 1.7950505 0.2160872 1.0331134 debye
dipolederiv: -0.618745 -0.0191964 -0.0550812 0.1306111 -0.1437382 0.0497612 -0.2179949 0.0166682 -0.1237543 -0.5343082 0.2488823 0.0218209 0.38553 -0.6221789 -0.0019273 -0.0252069 0.0175518 -0.2686363 -0.377564 0.0028428 0.1315223 -0.0031272 -0.2883445 0.0774772 0.1074876 0.0496106 -0.6023108 -0.8440161 0.0857457 0.236868 0.0861054 -0.2680353 -0.0098918 0.3486652 -0.0741942 -0.4809231 -0.5989266 -0.0314182 -0.2870858 -0.0164802 -0.225477 -0.0641195 -0.3833347 -0.0365657 -0.6539168 -0.1189608 -0.0499442 -0.1507786 -0.0236393 -0.077016 -0.0091665 -0.1295676 0.0387506 -0.0634466 0.6610945 0.2601062 0.0593448 0.2879016 0.1567339 0.031738 0.2239279 0.0696798 0.2160144 0.071885 0.0198248 0.05196 0.0876197 0.0307834 -0.0054547 0.0499196 -0.0343757 0.1172702 0.8462608 -0.1617395 -0.1441727 -0.4145639 0.8713152 -0.0542877 0.0007761 -0.0741166 0.8550988 -0.0418016 -0.0049865 0.0024041 0.079165 -0.1437136 -0.0632975 -0.0907533 -0.0363177 -0.0738564 0.0001476 -0.1566732 -0.0582135 -0.1749857 0.0620437 0.0530438 -0.0833934 0.0718993 0.0068311 1.666183 -0.2749321 0.1468135 -0.3475227 0.4550139 0.0291902 0.0838762 0.0081644 1.1074049 -0.0121658 0.0665137 -0.047933 -0.0307801 0.0906032 -0.005001 -0.0131838 0.0099515 -0.1159304 -0.090151 0.1082517 -0.0242755 0.0869751 0.0922397 -0.0365858 0.0008569 -0.059855 -0.1312283 -0.0642034 -0.0859159 -0.0530524 -0.1567543 -0.0034838 0.0466379 -0.0289291 0.0423447 -0.1316417 0.0271065 0.0102369 -0.0933617 0.0969668 -0.001826 -0.0370875 -0.0795489 -0.0116533 -0.1013666 -0.0116017 0.0227869 0.0603975 0.0035749 0.0737295 -0.0138702 0.0693061 -0.0162115 0.0077107 -0.0663306 -0.0334649 0.0059011 -0.0611286 0.0120985 0.012043 -0.0258798 0.0161745 -0.0658774 -0.0048946 -0.0055115 -0.0190265 -0.0132984 0.02754 -0.0742379 -0.0043414 -0.1225942 -0.0677701 0.025509 0.044892 -0.0001743 0.0373565 -0.0147214 0.0476411 -0.0187003 0.1091505 0.0464337 0.094527 -0.0724701 0.0330928 -0.0398331 -0.0623173 0.0182281 0.0173168 0.0151345 0.1361862 0.0823964 -0.0205129 0.0255205 -0.0566255 -0.0899773 0.0238905 0.0329258 0.0180025 0.1395494 -0.0116637 0.089495 0.0616458 0.1018549 -0.008558 -0.0359305 0.0666732 -0.0385467 0.1335471 -0.0797766 -0.0428129 0.0958638 -0.0449217 0.0772864 0.0212069 0.0991026 0.0213477 0.1146124 unknown
polarizability: 165.0562985|0.736419|132.4714501|-13.7603415|2.9660172|85.5763814 unknown
InChI: InChI=1S/C11H8F4S/c12-10(13)8-5-6-3-1-2-4-7(6)9(8)16-11(10,14)15/h1-4,8-9H,5H2
charge 0 multiplicity 1
24 atoms
S  -1.205582 -1.967986 0.173039
F  -2.573081 1.827291 -0.079763
F  -1.010019 0.872839 -1.427908
F  -3.471515 -0.562652 0.812092
F  -3.112004 -0.852301 -1.411067
C  -0.678369 0.719853 0.999894
C  -0.037832 -0.707436 1.085133
C  0.510846 1.706891 0.786897
C  -1.671085 0.726189 -0.16903
C  1.328012 -0.554516 0.454682
C  1.641522 0.817523 0.289349
C  -2.443023 -0.627061 -0.190483
C  2.250845 -1.558041 0.09661
C  2.88606 1.202077 -0.248557
C  3.499114 -1.172461 -0.444765
C  3.813479 0.198531 -0.616924
H  -1.264307 0.95154 1.904871
H  0.003394 -1.081054 2.120786
H  0.776188 2.186603 1.747604
H  0.256154 2.513857 0.077908
H  2.002423 -2.619058 0.213693
H  3.132665 2.26063 -0.388044
H  4.225881 -1.93718 -0.739363
H  4.781631 0.482427 -1.04405
