program: Gaussian 09
title: 000297485
version: EM64L-G09RevD.01
frameworkgroup: C1[X(C11H10ClF3N2S)]
method: RPBEPBE
basis: SDD
operation: Freq
keyword: #p
keyword: freq=noraman
keyword: PBEPBE/SDD
title: #p freq=noraman PBEPBE/SDD
converged: NO YES NO NO
title: Mulliken charges:
elementType: Cl S F F F N N C C C C C C C C C C C H H H H H H H H H H
charge: -0.046564 0.145203 -0.167152 -0.166456 -0.165783 -0.416395 -0.033889 -0.360070 -0.655889 -0.435408 -0.129390 0.587090 0.337629 -0.397422 -0.396848 -0.411348 -0.200309 0.245397 0.218698 0.242408 0.269542 0.271120 0.235751 0.221996 0.328548 0.346450 0.271635 0.261457
chargesum: 0.00000
title: Mulliken charges with hydrogens summed into heavy atoms:
elementType: Cl S F F F N N C C C C C C C C C C C
charge: -0.046564 0.145203 -0.167152 -0.166456 -0.165783 -0.087848 -0.033889 0.101036 -0.115227 0.022339 -0.129390 0.587090 0.337629 -0.050971 -0.396848 -0.139714 0.061148 0.245397
polarizability: 2.33954922e+02 -1.11611527e+01 1.92232047e+02 1.88278737e+00 -2.91791139e+00 8.02619084e+01
1716.lowfreq: -10.9508 -9.8605 -5.1235 -2.9450 -0.0015 -0.0007 0.0004 30.4972 43.8928
frequency: -9.5851 30.4014 43.8862 63.1391 72.9758 77.8397 142.4948 166.0101 180.2488 215.4707 230.0826 261.8879 266.5533 303.6984 330.6839 353.3855 366.6194 398.3920 430.9364 441.9149 466.8866 483.7245 524.0386 555.7370 562.9642 594.4504 603.0486 623.4932 631.1365 643.8023 707.9472 726.7814 744.8264 813.2007 838.1897 860.2652 886.0669 911.7480 939.0567 948.3842 979.1292 985.9774 1004.9125 1015.6300 1035.2771 1059.1581 1074.3166 1140.3026 1157.0491 1164.6143 1195.3727 1243.7938 1257.6241 1267.2190 1289.7337 1307.7910 1342.7266 1351.9409 1384.2564 1429.3468 1445.6319 1446.1200 1454.2503 1467.6051 1531.4381 1592.0712 1611.7815 1676.5064 2972.4903 2993.6987 3031.6385 3034.3349 3061.9206 3111.7358 3159.1336 3168.7632 3189.2247 3483.8004
redmass: 17.0151 7.1186 3.7290 7.7831 5.4218 5.0069 13.3032 5.8802 7.8904 4.3942 11.6655 10.6037 4.8759 2.1081 9.1057 8.1713 8.4980 4.4819 5.4522 4.3463 9.2978 5.4621 8.2906 5.4907 7.3321 3.2049 1.5212 6.3392 11.3690 3.5039 7.7343 4.0963 4.6423 1.3413 1.8730 2.5016 3.9578 2.6425 1.3882 1.3677 3.1469 9.8388 7.0738 6.2171 1.6612 2.7831 2.1458 1.9693 1.2199 1.8054 1.4830 2.3949 1.4524 1.2941 1.2234 2.5023 1.3310 1.3373 7.4043 5.3709 1.0856 1.0921 2.3151 1.1288 2.0516 4.7799 6.9678 6.9004 1.0650 1.0620 1.0833 1.0733 1.0990 1.1081 1.0936 1.0893 1.0972 1.0763
irintensity: 0.1196 0.1427 2.1750 0.4051 0.4583 0.8201 1.6475 0.1466 0.6066 2.1276 6.2434 0.8686 0.9588 6.0312 2.0907 3.4878 9.0990 4.6030 21.8225 7.4933 19.0550 7.2554 2.0741 6.9128 6.6476 0.3869 37.5369 4.9167 8.7426 41.2681 10.3214 0.6813 11.7376 64.4390 2.0793 1.5865 26.4898 58.4927 46.3732 9.9784 226.0694 200.7483 185.9341 65.2075 46.0561 54.7508 13.2336 19.6369 1.0399 27.5136 24.8475 118.3412 14.0991 6.4059 28.2876 174.5315 28.9059 31.1201 90.8385 249.7891 15.3922 10.0200 24.1880 9.1564 365.8364 44.1498 235.1203 214.0144 41.0551 31.8269 29.6802 21.4815 33.1222 12.6317 31.6354 1.7771 0.4954 57.0647
temp: 298.150 k
press: 1.00000 atm
elementType: 17 16 9 9 9 7 7 6 6 6 6 6 6 6 6 6 6 6 1 1 1 1 1 1 1 1 1 1
symmnumber: 1
zpe: 511766.5 jmol-1
zpe.correction: 0.194922 hartree
zpe.thermalcorrener: 0.211036 hartree
zpe.thermalcorrenthalpy: 0.211981 hartree
zpe.thermalcorrgfe: 0.149674 hartree
zpe.sumelectzpe: -1691.009585 hartree
zpe.sumelectthermal: -1690.993471 hartree
zpe.sumelectthermalent: -1690.992526 hartree
zpe.sumelectthermalfe: -1691.054833 hartree
dipole: 4.0535 0.6105 0.1458
dipole: 4.1018
quadrupole: -106.0637 -116.9127 -121.7297
quadrupole: -21.4933 1.5431 -0.0891
quadrupole: 8.8383 -2.0107 -6.8277 -21.4933 1.5431 -0.0891
hfenergy: -1691.2045069 hartree
pointgroup: C01 [X(C11H10Cl1F3N2S1)]
dipole: 1.570123 0.3225701 0.1869205 debye
polarizability: 234.8849424|-9.4518886|188.0416253|6.7848832|17.6916517|83.5223088 unknown
InChI: InChI=1S/C11H10ClF3N2S/c12-8-3-2-7(11(13,14)15)6-9(8)17-10-16-4-1-5-18-10/h2-3,6,17H,1,4-5H2
charge 0 multiplicity 1
28 atoms
Cl -0.20958 3.88187 0.640709
S  3.90707 1.12296 0.204306
F  -4.264463 -1.439172 -0.629657
F  -2.384198 -2.09645 -1.71664
F  -2.588848 -2.465425 0.504704
N  1.224079 1.255681 0.260906
N  1.97145 -0.975432 -0.062456
C  4.408458 -1.530581 -0.651171
C  4.955179 -0.458031 0.303998
C  3.0000 -2.017696 -0.244264
C  2.220341 0.279335 0.114988
C  -0.168516 1.113432 0.142503
C  -2.225076 -0.171976 -0.232136
C  -0.819142 -0.12161 -0.120237
C  -0.99816 2.265344 0.292808
C  -3.02579 0.980948 -0.082633
C  -2.393977 2.214513 0.185418
C  -2.856569 -1.505555 -0.511357
H  5.092118 -2.401775 -0.644263
H  4.39267 -1.128692 -1.680991
H  4.955703 -0.799817 1.352196
H  5.969678 -0.132077 0.025236
H  2.617136 -2.721799 -1.006089
H  3.062133 -2.591288 0.703592
H  1.549265 2.202964 0.480723
H  -0.190066 -1.009433 -0.223592
H  -4.113194 0.924431 -0.170112
H  -2.982102 3.127633 0.308509
