program: Gaussian 09
title: 000297477
version: EM64L-G09RevD.01
frameworkgroup: C1[X(C10H9ClN2O3)]
method: RPBEPBE
basis: SDD
operation: Freq
keyword: #p
keyword: freq=noraman
keyword: PBEPBE/SDD
title: #p freq=noraman PBEPBE/SDD
converged: YES YES NO NO
title: Mulliken charges:
elementType: Cl O O O N N C C C C C C C C C C H H H H H H H H H
charge: -0.085760 -0.271216 -0.199917 -0.202924 -0.374412 0.027546 0.298642 -0.328788 -0.331292 0.190622 0.390078 -0.354574 -0.364500 -0.445691 0.166820 -0.558258 0.286210 0.236301 0.291274 0.289741 0.258298 0.267137 0.320252 0.250949 0.243460
chargesum: 0.00000
title: Mulliken charges with hydrogens summed into heavy atoms:
elementType: Cl O O O N N C C C C C C C C C C
charge: -0.085760 -0.271216 -0.199917 -0.202924 -0.054159 0.027546 0.298642 -0.042577 -0.094991 0.190622 0.390078 -0.063300 -0.074759 0.079744 0.166820 -0.063849
polarizability: 2.09696250e+02 -1.73335320e+01 1.45513038e+02 -8.79024985e+00 -2.21398899e+01 8.77424152e+01
1716.lowfreq: -7.9978 -3.5027 0.0011 0.0014 0.0022 4.3764 17.9928 30.0282 42.2899
frequency: 17.6712 30.0184 42.2867 49.5629 67.9400 87.8554 113.8586 196.8745 219.9643 257.3026 269.8155 308.5929 361.5048 368.1456 408.2482 420.0218 459.1901 489.7433 516.7601 545.2881 570.5980 608.3737 624.3501 660.2088 678.2331 688.1798 698.2829 765.1331 771.3789 812.3752 850.3457 883.7125 912.3849 934.6104 970.0907 987.1728 1003.8432 1009.7218 1036.2877 1091.8402 1110.9072 1130.2436 1153.1437 1182.4879 1219.4582 1244.3252 1269.7090 1297.0589 1343.4710 1365.4336 1401.9658 1408.4396 1409.0881 1434.6405 1469.1061 1494.7004 1577.8274 1605.9931 1609.9460 1668.4486 3004.8567 3086.5014 3114.0515 3142.6075 3166.6395 3184.5969 3188.1694 3227.1599 3552.8038
redmass: 5.6108 11.3125 4.8227 9.5771 6.3224 8.4124 5.5161 6.8732 7.0355 7.1029 8.4816 5.4067 2.7461 2.5100 2.8624 5.5097 4.9857 7.6146 5.3963 2.2631 2.3340 2.7103 6.2936 5.1645 5.0695 2.1685 1.6035 4.8656 5.9447 4.7972 1.3249 1.6099 2.1342 1.3322 2.4324 1.3685 2.2955 1.5923 3.5280 3.2188 1.3021 3.0560 2.4458 1.3727 5.7853 1.3052 2.0034 1.2856 1.2638 7.0513 11.4074 1.1613 3.6986 1.1423 2.0267 2.0916 8.1052 7.1625 6.8486 6.2791 1.0628 1.0991 1.0636 1.0902 1.0897 1.0947 1.0965 1.1150 1.0775
irintensity: 1.2991 0.3039 1.5845 4.1615 0.3589 10.6460 5.1489 1.4153 3.3619 3.0546 1.0461 6.1362 0.5629 9.7742 0.3834 7.0877 7.6290 5.3555 7.4531 51.8713 71.2821 49.8446 3.2948 3.5472 2.6574 35.3008 22.8154 4.0387 35.6806 8.8717 9.1468 47.0475 7.7426 80.1811 8.1529 2.2001 7.3842 0.2282 2.1203 18.6635 23.1261 89.7510 39.8639 31.8480 341.8980 4.5140 125.6096 4.8625 6.9010 87.6375 1.5345 6.7949 50.0786 37.1208 85.8501 222.7600 92.8951 32.8477 16.3665 40.9395 28.8587 4.5370 0.6404 9.2608 1.2357 1.3378 1.3981 1.7809 22.7413
temp: 298.150 k
press: 1.00000 atm
elementType: 17 8 8 8 7 7 6 6 6 6 6 6 6 6 6 6 1 1 1 1 1 1 1 1 1
symmnumber: 1
zpe: 465655.7 jmol-1
zpe.correction: 0.177359 hartree
zpe.thermalcorrener: 0.192391 hartree
zpe.thermalcorrenthalpy: 0.193335 hartree
zpe.thermalcorrgfe: 0.131497 hartree
zpe.sumelectzpe: -1180.452799 hartree
zpe.sumelectthermal: -1180.437768 hartree
zpe.sumelectthermalent: -1180.436823 hartree
zpe.sumelectthermalfe: -1180.498661 hartree
dipole: -4.7863 -0.4756 1.1338
dipole: 4.9417
quadrupole: -123.0270 -103.8635 -96.6609
quadrupole: 2.0431 1.8527 -5.7363
quadrupole: -15.1765 3.9870 11.1896 2.0431 1.8527 -5.7363
hfenergy: -1180.6301582 hartree
pointgroup: C01 [X(C10H9Cl1N2O3)]
dipole: 1.8660435 0.3728844 0.3984623 debye
dipolederiv: -0.179307 0.0366057 0.0486845 0.0156945 -0.6689952 0.1462747 0.1088115 0.196124 -0.2284506 -0.8248038 0.1733142 -0.0472121 -0.1642313 -0.8723837 0.0959338 -0.0348231 0.0474843 -0.3461396 -0.7664986 -0.1361788 -0.1683277 -0.1291292 -0.5458898 -0.1554619 -0.1853136 -0.1610374 -0.3258921 -0.7074421 0.2115596 -0.0179778 0.2347654 -0.6566913 -0.1241113 -0.029157 -0.1169572 -0.2785579 -1.1955404 -0.3249832 0.0934237 -0.4860323 -0.5817999 -0.0098671 -0.0269049 -0.1514855 -0.5075336 1.8079509 -0.1595101 0.2847448 -0.1965686 0.9853256 0.2729997 0.3239692 0.2737588 0.3699472 -0.1818592 0.0155865 -0.0348574 0.0533559 0.0429922 0.0568099 -0.0813621 0.0447998 0.0321185 -0.246555 -0.1482876 -0.0724345 -0.0591172 0.0459163 0.0382006 -0.0755718 0.0013113 -0.113107 -0.1965274 0.1506046 0.0754334 0.0892734 -0.0579933 0.0675782 0.1198367 0.0652047 -0.0729495 1.6321655 0.1254267 0.1228461 0.6393732 1.1923027 -0.1228719 0.1796496 0.0160076 0.2127018 -0.6583001 0.0868655 -0.1075512 0.140444 0.057336 0.0287283 -0.115462 0.0201598 0.0459876 0.1269083 0.126009 0.1002448 -0.1696984 -0.0420884 -0.0116506 -0.0074771 0.0526789 -0.0812679 0.0764558 -0.1418705 -0.0206514 0.0826678 -0.0462016 0.0383933 0.081529 -0.0149002 -0.0824084 0.7561916 0.1413421 -0.0315425 -0.1796865 -0.1326351 0.0873273 0.0464414 0.1310342 0.2742922 0.0044752 -0.1728025 -0.2029218 -0.0326976 1.0416347 -0.2392065 -0.3177929 -0.3006402 0.1848505 -0.3776212 0.0651758 -0.0662414 0.0236276 -0.3016253 -0.0706099 0.0280203 -0.0427355 -0.1904938 0.1168846 0.0571829 0.0072957 0.0312039 0.0456693 -0.0411614 0.0246978 -0.0202044 0.1426009 0.0285572 -0.0760045 -0.065356 -0.0831625 0.0250055 -0.0620351 -0.081594 -0.053989 0.1016928 0.0934483 -0.047408 -0.0351251 -0.0161275 0.0943846 -0.0347317 -0.0312404 -0.0413281 0.1477674 0.1094795 0.0504667 0.0062757 0.0291739 0.0670186 -0.0359108 -0.0099257 -0.0305594 0.1560084 -0.0798322 -0.031101 0.0075111 -0.057271 0.0446198 -0.1279071 -0.0241283 -0.0836039 -0.0114081 0.1162949 -0.0219186 0.0402711 0.1299762 0.0310535 0.0498468 0.0480295 0.0342779 0.0913468 0.218483 0.0131628 -0.0475777 0.1045569 0.1414015 0.0338914 -0.0947486 0.0429757 0.3204576 0.1477084 -0.0055121 0.0993897 0.0097104 0.1103627 0.0485774 0.1277962 0.0484162 0.0511516 0.1792839 0.0122748 0.0316562 -0.0101014 -0.0187194 0.0709641 0.0267205 0.0432077 0.1072853 unknown
polarizability: 211.7432291|-11.7093684|148.6130742|8.9849799|14.1838385|82.5953991 unknown
InChI: InChI=1S/C10H9ClN2O3/c1-7(11)6-12-10(14)8-2-4-9(5-3-8)13(15)16/h2-5,12H,1,6H2
charge 0 multiplicity 1
25 atoms
Cl 4.334109 2.166483 -0.905937
O  1.747632 -1.900968 0.715339
O  -4.967676 -0.638144 -0.893066
O  -4.772734 1.462123 -0.024219
N  2.200824 0.382638 0.75626
N  -4.283797 0.313212 -0.352539
C  -0.114572 -0.377355 0.390845
C  -0.915797 -1.3972 -0.184635
C  -0.707107 0.865141 0.740543
C  1.341312 -0.699961 0.631516
C  -2.840545 0.07126 -0.092204
C  -2.282142 -1.179504 -0.436355
C  -2.074996 1.09756 0.501588
C  3.646761 0.184308 0.949413
C  4.449101 0.416344 -0.313839
C  5.193885 -0.470601 -1.001386
H  -0.442851 -2.355858 -0.417705
H  -0.120883 1.646848 1.235805
H  -2.917147 -1.947297 -0.885517
H  -2.556217 2.042035 0.767878
H  4.004249 0.860489 1.74851
H  3.785953 -0.860045 1.276243
H  1.880213 1.325612 0.529176
H  5.751812 -0.200078 -1.901648
H  5.242711 -1.510441 -0.659764
