program: Gaussian 09
title: 000297476
version: EM64L-G09RevD.01
frameworkgroup: C1[X(C9H8ClNO2)]
method: RPBEPBE
basis: SDD
operation: Freq
keyword: #p
keyword: freq=noraman
keyword: PBEPBE/SDD
title: #p freq=noraman PBEPBE/SDD
converged: YES YES NO NO
title: Mulliken charges:
elementType: Cl O O N C C C C C C C C C H H H H H H H H
charge: -0.030067 -0.215174 -0.213578 0.041379 0.490176 -0.339251 0.327558 -0.309110 -0.347049 -0.233342 -0.247842 -0.776605 -0.216478 0.292350 0.262172 0.262915 0.240019 0.251504 0.273510 0.243822 0.243089
chargesum: 0.00000
title: Mulliken charges with hydrogens summed into heavy atoms:
elementType: Cl O O N C C C C C C C C C
charge: -0.030067 -0.215174 -0.213578 0.041379 0.490176 -0.046900 0.327558 -0.309110 -0.084877 0.029573 -0.007823 -0.007769 0.026611
polarizability: 2.09897110e+02 -4.68876482e+00 1.37461027e+02 -2.68960232e+00 -8.26575678e-01 5.71563230e+01
1716.lowfreq: -10.0187 -7.2289 -0.0007 0.0020 0.0021 8.8386 36.8494 61.3062 80.5930
frequency: 36.8222 61.2938 80.5901 94.3726 157.9391 185.2860 231.7585 241.7436 288.9629 355.0680 386.7651 402.4818 426.5017 467.0800 517.1798 529.8183 586.8336 656.7617 674.5431 692.9128 732.0961 762.8897 800.5112 834.1637 870.9272 935.2941 955.1279 977.4397 990.1931 1020.3220 1042.9762 1045.9677 1100.2186 1129.8765 1174.8283 1185.5447 1225.0487 1288.3403 1342.1973 1367.8832 1378.2605 1412.4545 1425.8168 1453.7932 1460.8401 1471.8129 1562.9530 1599.8723 1654.2227 2993.0088 3079.1485 3116.2785 3124.5266 3143.2241 3158.2471 3172.5095 3181.1382
redmass: 6.8345 6.3057 4.7706 6.0678 2.7071 1.9993 3.1967 6.8390 4.9551 3.1056 5.5309 7.4153 3.8136 3.1930 5.6517 3.2829 6.8877 6.1215 5.8319 5.9096 3.9564 1.3332 4.7488 5.2188 1.3705 1.4742 1.3999 2.2428 1.3495 6.4459 1.8765 1.5140 1.9226 1.7048 1.1232 7.6438 1.8063 1.6078 2.5490 5.5484 3.2864 1.3631 2.3108 1.2583 1.7200 1.1318 5.6873 6.8641 7.8447 1.0402 1.0932 1.0997 1.0875 1.0862 1.0909 1.0946 1.1001
irintensity: 0.3647 1.5863 0.1571 0.1467 0.5115 0.1309 0.1095 4.2677 3.4635 0.2889 1.3476 4.7541 3.2174 17.6130 1.4574 5.3268 8.7179 4.1350 4.8948 21.5533 5.7442 82.2798 33.2464 13.7317 1.6941 30.8676 5.4245 56.9361 0.6342 46.2137 0.6749 1.3391 14.2195 0.9154 28.4091 356.8260 5.4049 14.3925 5.6206 128.5260 5.8330 7.2369 41.9420 17.2884 16.7887 19.0215 8.5088 20.5397 49.7787 7.0991 8.3599 3.9342 4.9553 0.7678 7.9739 7.9089 11.7367
temp: 298.150 k
press: 1.00000 atm
elementType: 17 8 8 7 6 6 6 6 6 6 6 6 6 1 1 1 1 1 1 1 1
symmnumber: 1
zpe: 396231.1 jmol-1
zpe.correction: 0.150916 hartree
zpe.thermalcorrener: 0.162911 hartree
zpe.thermalcorrenthalpy: 0.163856 hartree
zpe.thermalcorrgfe: 0.111294 hartree
zpe.sumelectzpe: -1011.984589 hartree
zpe.sumelectthermal: -1011.972594 hartree
zpe.sumelectthermalent: -1011.971650 hartree
zpe.sumelectthermalfe: -1012.024211 hartree
dipole: 5.4565 -4.0032 0.5094
dipole: 6.7866
quadrupole: -91.3028 -78.1497 -84.1435
quadrupole: 2.0521 -2.3218 1.6187
quadrupole: -6.7708 6.3823 0.3885 2.0521 -2.3218 1.6187
hfenergy: -1012.1355052 hartree
pointgroup: C01 [X(C9H8Cl1N1O2)]
dipole: -2.3257606 -1.1508012 -0.6291162 debye
dipolederiv: -0.1086379 -0.1586448 -0.0363909 -0.0352199 -0.6647754 -0.1615167 -0.0029531 -0.1637466 -0.0920041 -0.6317759 -0.0831743 -0.0914253 -0.2693702 -0.4615581 -0.2733801 -0.2685447 -0.2718312 -0.5307958 -0.962734 0.1684678 0.2112293 0.1121379 -0.3755339 -0.1736748 0.1845276 -0.1646583 -0.4307339 2.0206232 -0.0559381 -0.1194964 0.393421 0.5348944 0.4023238 0.2727962 0.4078415 0.6185767 -0.2720101 -0.0808551 -0.0340508 -0.0883558 -0.2299442 -0.0712209 -0.0648164 -0.0689771 0.0141635 0.7644242 -0.0082013 -0.0362277 -0.0900496 -0.1049305 -0.0166802 -0.1147091 -0.0243699 -0.1109631 -1.0593903 -0.036996 0.0052487 -0.0352761 0.1597705 0.2228537 -0.0719199 0.165958 0.1967449 0.2308442 0.3398833 0.081953 -0.0582161 0.9925518 0.2785259 -0.1021316 0.2722271 -0.0023646 0.088769 -0.0026169 0.0296847 0.1240367 0.0167378 0.0233139 0.1418032 0.0187832 -0.1265057 -0.1252159 -0.2102016 -0.0459883 -0.2168019 -0.2373104 -0.0305942 -0.0470207 -0.0391283 -0.1040386 -0.2406429 0.0968652 0.0281181 0.1597261 0.0605484 0.0402406 0.0101507 0.0511565 -0.136853 -0.0730956 0.012066 0.0279104 0.0540698 -0.0355054 -0.1526964 0.0358452 -0.139753 -0.0906594 0.0955107 -0.0106981 0.0131775 -0.0151368 0.0887163 0.0587524 0.0036572 0.0531343 -0.1224527 0.1115861 -0.0011937 0.0057826 -0.067201 0.104362 -0.0600349 0.0399448 -0.0367421 0.1256208 0.0272965 0.0846686 0.0003431 0.0729905 -0.0027347 -0.0362101 -0.0007657 -0.0325127 0.1330725 0.0378667 0.0543976 0.0129154 0.0762392 0.0236778 -0.0353672 0.0222769 -0.0291631 0.1581016 0.0534371 -0.0451066 -0.009986 -0.0748603 -0.0637277 -0.0513492 -0.0298947 -0.0490267 0.1529687 0.1224962 0.0033256 -0.0211544 0.0448401 -0.0710111 0.0207854 0.0080261 0.065326 0.0509045 0.0430053 -0.0137284 0.1141654 -0.0528314 0.1072672 0.0417706 0.0639467 0.0124164 0.0605999 -0.0312797 -0.0173124 -0.1234065 0.0002039 0.0789739 -0.0052042 -0.068861 -0.0026356 0.0806732 -0.0910767 -0.0350068 -0.0124019 -0.0343461 0.0795312 -0.0206375 -0.0113577 -0.0242986 0.1559445 unknown
polarizability: 209.6518437|-0.8178991|124.1442429|-8.4126401|29.743231|70.7183736 unknown
InChI: InChI=1S/C9H8ClNO2/c1-7(11(12)13)6-8-4-2-3-5-9(8)10/h2-6H,1H3
charge 0 multiplicity 1
21 atoms
Cl -1.240192 2.783784 0.829904
O  3.161301 1.082423 1.029207
O  4.048304 -0.318082 -0.534373
N  3.040743 0.215732 0.078246
C  -0.801226 0.082565 0.14617
C  0.629689 0.36737 0.303241
C  1.674306 -0.225951 -0.352177
C  -1.775456 1.093497 0.396907
C  -1.302263 -1.214289 -0.184409
C  -3.15802 0.857954 0.30339
C  -2.683305 -1.471641 -0.276523
C  1.668016 -1.218082 -1.482669
C  -3.615322 -0.434717 -0.039002
H  0.900449 1.153334 1.020323
H  -0.591839 -2.033999 -0.321562
H  -3.864288 1.670496 0.495042
H  -3.03338 -2.479672 -0.520544
H  1.869808 -2.246731 -1.129696
H  2.464721 -0.973163 -2.203503
H  0.694222 -1.203688 -1.997193
H  -4.69097 -0.62604 -0.10908
