program: Gaussian 09
title: 000297483
version: EM64L-G09RevD.01
frameworkgroup: C1[X(C9H14F3NO)]
method: RPBEPBE
basis: SDD
operation: Freq
keyword: #p
keyword: freq=noraman
keyword: PBEPBE/SDD
title: #p freq=noraman PBEPBE/SDD
converged: NO YES NO NO
title: Mulliken charges:
elementType: F F F O N C C C C C C C C C H H H H H H H H H H H H H H
charge: -0.168009 -0.170823 -0.164128 -0.277715 -0.404941 -0.143267 -0.034179 -0.458519 -0.476030 -0.436022 -0.473106 0.356415 0.251554 -0.777392 0.261845 0.267869 0.236782 0.230221 0.213118 0.243602 0.202446 0.259906 0.228028 0.213598 0.301087 0.253801 0.209215 0.254642
chargesum: 0.00000
title: Mulliken charges with hydrogens summed into heavy atoms:
elementType: F F F O N C C C C C C C C C
charge: -0.168009 -0.170823 -0.164128 -0.277715 -0.103853 0.118578 0.233691 0.008485 -0.019309 0.026331 -0.031481 0.356415 0.251554 -0.059734
polarizability: 1.21487376e+02 -7.06252734e+00 9.54759869e+01 -4.14376349e+00 -2.54046706e+00 9.52757013e+01
1716.lowfreq: -22.8772 -0.0007 -0.0001 0.0007 2.7825 5.6260 31.4941 45.3507 50.1934
frequency: 31.0613 45.3470 50.1675 66.6543 110.5154 138.9842 155.6389 195.2103 219.1583 247.8896 318.4886 344.5007 348.2012 380.3366 418.3236 434.5465 461.1840 501.2801 502.4915 511.6168 588.3850 590.0742 608.5558 663.8279 773.7595 784.5802 822.7815 865.5809 899.1859 917.6197 946.8518 953.1479 971.7521 1006.5742 1020.7884 1025.6063 1041.2368 1060.5951 1081.2755 1099.1586 1143.2821 1156.1821 1192.9603 1208.3334 1239.4185 1251.9109 1274.2445 1296.2748 1314.4147 1318.3704 1330.4098 1339.8892 1349.4673 1364.6617 1375.4345 1387.0410 1449.6451 1456.3794 1463.3010 1470.3420 1472.5544 1474.2922 1489.2875 1614.8748 2981.9713 2985.7407 2989.9572 2995.4649 2996.2465 3005.4479 3026.9256 3048.0409 3058.0580 3065.3884 3071.2275 3097.4358 3098.3580 3551.2828
redmass: 5.2237 6.2684 6.3172 1.2154 2.5893 3.8905 6.5035 7.0692 2.4785 3.9701 3.6600 2.8309 7.1232 2.4517 3.6030 2.4257 2.6147 10.8524 4.0514 1.4358 3.7182 3.8895 4.1812 3.3135 3.0974 1.5061 3.7191 2.5740 2.7099 2.5955 1.5970 2.6765 2.1917 4.2242 2.9453 2.5077 1.6491 2.0060 1.8654 1.2961 2.5623 2.0422 1.4354 4.1813 1.6124 1.5339 1.3075 1.4079 1.5329 1.4148 1.4023 1.4409 1.4885 1.3517 1.4678 1.2357 1.0470 1.2275 1.2106 1.0973 1.1196 1.2366 1.1985 6.3000 1.0665 1.0661 1.0625 1.0362 1.0695 1.0720 1.0852 1.0987 1.1003 1.0984 1.0998 1.1005 1.0980 1.0780
irintensity: 3.8150 6.1644 7.2911 2.5104 1.5272 0.9540 2.5658 3.4142 0.7147 3.3922 8.3671 4.6275 2.3721 0.1198 0.6360 4.1735 9.0297 0.4320 2.2867 88.3627 5.8678 7.5149 4.4574 2.2693 16.9107 0.3747 6.9405 10.3519 36.1498 13.6420 13.9663 19.0085 51.3246 127.2367 92.3196 63.9436 12.6016 5.8716 3.2247 17.4079 26.8521 9.7783 7.9248 165.4322 30.2711 16.6480 0.4988 2.8065 86.6135 6.7520 4.1017 7.6492 3.6961 3.6467 1.5218 66.9805 15.7200 140.0822 100.7712 28.6353 8.6360 48.3335 52.3714 176.7893 12.7176 22.3667 26.4073 10.1041 8.2834 19.6140 24.4438 32.4158 31.4360 21.9851 30.7308 21.4477 8.7475 13.4521
temp: 298.150 k
press: 1.00000 atm
elementType: 9 9 9 8 7 6 6 6 6 6 6 6 6 6 1 1 1 1 1 1 1 1 1 1 1 1 1 1
symmnumber: 1
zpe: 589803.5 jmol-1
zpe.correction: 0.224644 hartree
zpe.thermalcorrener: 0.238985 hartree
zpe.thermalcorrenthalpy: 0.239929 hartree
zpe.thermalcorrgfe: 0.181996 hartree
zpe.sumelectzpe: -779.791645 hartree
zpe.sumelectthermal: -779.777304 hartree
zpe.sumelectthermalent: -779.776360 hartree
zpe.sumelectthermalfe: -779.834293 hartree
dipole: -0.2316 -0.6697 -2.3998
dipole: 2.5022
quadrupole: -108.2818 -78.7427 -82.0763
quadrupole: -10.7169 9.7904 -0.5039
quadrupole: -18.5815 10.9575 7.6240 -10.7169 9.7904 -0.5039
hfenergy: -780.0162896 hartree
pointgroup: C01 [X(C9H14F3N1O1)]
dipole: 0.1366585 -0.3579216 -0.9068393 debye
polarizability: 120.6925926|-3.1122748|97.8307343|8.9249355|0.4682903|93.7157374 unknown
InChI: InChI=1S/C9H14F3NO/c1-6(14)13-8-4-2-7(3-5-8)9(10,11)12/h7-8,13H,2-5H2,1H3
charge 0 multiplicity 1
28 atoms
F  -3.738139 -0.41027 -0.759083
F  -2.509108 -1.590127 0.740215
F  -3.554544 0.320284 1.378877
O  3.80373 0.746347 0.97014
N  2.030505 -0.321137 -0.079615
C  -1.590379 0.536654 -0.064757
C  1.357677 0.94391 -0.454796
C  -0.641031 0.724936 1.149601
C  -0.851845 -0.116149 -1.264266
C  0.591265 1.561626 0.747114
C  0.401707 0.707157 -1.647307
C  -2.822082 -0.268624 0.31751
C  3.230792 -0.329737 0.614115
C  3.816922 -1.707163 0.914178
H  -1.966523 1.53162 -0.378644
H  2.159755 1.647173 -0.74663
H  -1.179141 1.217936 1.978919
H  -0.315261 -0.267336 1.516999
H  -0.575857 -1.155209 -0.993704
H  -1.528883 -0.189004 -2.134376
H  0.274891 2.587161 0.467593
H  1.285905 1.660373 1.599195
H  0.942248 0.208195 -2.473828
H  0.080479 1.696374 -2.027633
H  1.6011 -1.208075 -0.346553
H  3.934475 -1.819917 2.005773
H  3.204203 -2.543068 0.533662
H  4.825238 -1.773331 0.470403
