program: Gaussian 09
title: 000297463
version: EM64L-G09RevD.01
frameworkgroup: C1[X(C13H23NO)]
method: RPBEPBE
basis: SDD
operation: Freq
keyword: #p
keyword: freq=noraman
keyword: PBEPBE/SDD
title: #p freq=noraman PBEPBE/SDD
converged: YES YES NO NO
title: Mulliken charges:
elementType: O N C C C C C C C C C C C C C H H H H H H H H H H H H H H H H H H H H H H H
charge: -0.451107 -0.082806 0.040430 0.032644 -0.517750 -0.454359 -0.462331 -0.464609 -0.458883 -0.405415 -0.406687 -0.383557 -0.524584 -0.537316 0.198698 0.203835 0.204014 0.198863 0.197746 0.189487 0.197648 0.202398 0.192290 0.217536 0.211479 0.209898 0.209002 0.196218 0.191919 0.189462 0.196480 0.198709 0.187669 0.207307 0.233922 0.264809 0.213704 0.363237
chargesum: 0.00000
title: Mulliken charges with hydrogens summed into heavy atoms:
elementType: O N C C C C C C C C C C C C C
charge: -0.087870 -0.082806 0.244265 0.236658 -0.121141 -0.067224 -0.067643 -0.035594 -0.039984 -0.017277 -0.020744 0.002821 -0.083356 -0.058804 0.198698
polarizability: 1.96732806e+02 -3.94391561e+00 1.27967352e+02 -4.92756870e+00 -2.24215148e+00 1.20118007e+02
1716.lowfreq: -23.8202 -8.3792 -0.0006 -0.0003 0.0005 16.2909 25.5418 34.3103 64.9865
frequency: 25.0290 33.8037 64.9654 88.0989 139.1897 166.2885 186.1897 220.6562 229.1937 253.1916 288.2300 311.2902 315.0269 360.8234 397.9667 415.4989 423.1797 432.5050 446.4001 458.8861 513.9725 551.2811 552.9341 664.3884 750.1149 766.7948 781.0260 784.7595 798.5011 841.1278 845.7696 862.1228 890.8857 906.8813 919.8999 926.0416 940.8328 963.1009 967.5273 1021.4608 1038.1250 1051.7342 1057.9388 1076.7989 1085.0066 1091.4974 1108.3408 1110.4388 1117.6116 1134.9291 1160.8339 1181.8790 1202.2278 1214.1571 1241.4460 1248.0541 1253.0833 1258.9369 1268.4030 1274.4279 1290.9281 1300.4468 1305.3402 1314.1389 1319.4503 1330.8574 1334.5921 1338.8499 1340.6048 1342.9641 1346.0158 1352.6154 1361.5290 1367.4611 1452.2967 1453.8408 1459.2537 1461.7693 1462.5189 1463.2081 1465.2595 1469.3945 1474.3989 1477.9519 1622.7383 2936.4419 2940.3689 2944.2510 2948.6047 2957.0689 2961.0175 2961.3066 2962.9789 2964.4248 2968.0848 2971.1397 2973.9341 2995.4413 3013.5541 3020.6982 3024.6062 3025.1473 3030.4042 3038.2935 3039.1830 3061.5364 3085.1872 3572.9452
redmass: 3.2511 4.7237 3.4138 3.6880 2.7764 2.7330 3.0115 1.9631 2.6014 3.2211 3.2465 3.0968 1.7455 1.8040 1.7515 1.8852 1.6289 2.9012 3.2139 2.1366 2.8049 1.9569 3.8573 2.9517 3.3308 2.5706 1.5347 1.5087 1.9266 1.9089 2.3992 4.2552 1.6229 1.6170 1.7441 1.4702 2.2914 2.3738 2.1238 2.6482 1.8678 1.7786 1.1314 1.9555 1.6424 1.3150 2.0628 1.8875 2.5202 1.6961 1.4494 1.6683 1.5487 1.4285 1.3320 1.3592 1.2794 1.2644 1.2697 1.2706 1.3248 1.3146 1.2665 1.2462 1.3554 1.4127 1.3850 1.5494 1.5429 1.4688 1.7853 1.4629 1.4894 1.5863 1.0860 1.0924 1.0893 1.0873 1.0901 1.0884 1.0867 1.0834 1.0921 1.0922 7.0572 1.0599 1.0778 1.0768 1.0642 1.0671 1.0629 1.0669 1.0612 1.0658 1.0616 1.0668 1.0621 1.0993 1.0962 1.0992 1.0963 1.0994 1.1009 1.1033 1.1002 1.0952 1.0932 1.0674
irintensity: 0.0598 0.0883 0.0217 0.0092 0.0777 0.0346 0.2108 0.1959 0.5488 0.6603 0.6793 7.1149 0.1751 29.4045 69.3650 8.4466 35.3208 1.4231 3.5067 1.8373 7.9548 2.0959 12.9100 3.0270 0.4612 2.2589 4.4909 0.5167 2.4585 24.6309 4.2835 122.5220 10.5250 4.9132 6.8617 4.8867 15.0253 14.4087 18.2530 6.7788 0.5043 0.7441 0.4049 1.6202 0.5326 0.6755 0.2154 7.5452 1.1959 11.0135 1.5929 13.0463 4.0995 27.9698 10.3120 9.6856 0.9408 1.6814 0.5573 6.7026 1.8206 2.6094 10.1952 0.5853 3.5502 1.4814 0.0937 1.6134 0.1285 0.8190 1.9781 1.2241 1.0674 4.2544 4.3247 8.4699 5.2135 17.7626 7.7856 4.7736 16.2799 16.1715 4.0552 3.0690 7.3641 16.4067 9.2304 0.7617 32.0510 55.0130 18.3530 28.9712 30.9440 34.3509 31.8620 6.7502 64.0983 21.9364 101.4902 58.7406 57.8850 25.2138 41.4727 158.5045 61.7564 26.2648 9.6583 37.0607
temp: 298.150 k
press: 1.00000 atm
elementType: 8 7 6 6 6 6 6 6 6 6 6 6 6 6 6 1 1 1 1 1 1 1 1 1 1 1 1 1 1 1 1 1 1 1 1 1 1 1
symmnumber: 1
zpe: 891138.6 jmol-1
zpe.correction: 0.339417 hartree
zpe.thermalcorrener: 0.354571 hartree
zpe.thermalcorrenthalpy: 0.355516 hartree
zpe.thermalcorrgfe: 0.296515 hartree
zpe.sumelectzpe: -637.914667 hartree
zpe.sumelectthermal: -637.899512 hartree
zpe.sumelectthermalent: -637.898568 hartree
zpe.sumelectthermalfe: -637.957569 hartree
dipole: -1.4468 -0.0938 0.2719
dipole: 1.4751
quadrupole: -96.6952 -94.0255 -92.4469
quadrupole: -1.1565 -1.3099 0.3546
quadrupole: -2.3060 0.3637 1.9423 -1.1565 -1.3099 0.3546
hfenergy: -638.2540836 hartree
pointgroup: C01 [X(C13H23N1O1)]
dipole: 0.5689432 -0.0289708 -0.1108681 debye
polarizability: 196.5481521|4.883017|128.0662846|-5.4433981|2.1755969|120.2037275 unknown
InChI: InChI=1S/C13H23NO/c15-14-13-8-6-12(7-9-13)10-11-4-2-1-3-5-11/h11-12,15H,1-10H2
charge 0 multiplicity 1
38 atoms
O  -5.508175 -0.412955 0.214776
N  -4.509964 0.593263 0.656698
C  2.032992 -0.267255 0.268605
C  -0.534074 -0.341604 -0.348803
C  0.762579 -1.116136 0.002259
C  3.224867 -1.190874 0.635868
C  2.413994 0.639208 -0.93102
C  -0.952448 0.660918 0.757853
C  -1.693746 -1.334567 -0.621077
C  4.525199 -0.397957 0.905547
C  3.714507 1.436803 -0.66763
C  4.890298 0.502051 -0.298625
C  -2.262898 1.410649 0.395624
C  -3.023508 -0.625098 -0.998038
C  -3.366406 0.436483 0.02738
H  1.844775 0.391703 1.144763
H  -0.361426 0.236676 -1.283458
H  0.564477 -1.744507 0.897634
H  0.983565 -1.822374 -0.827375
H  3.398654 -1.900322 -0.201866
H  2.961374 -1.804731 1.520789
H  1.589029 1.341571 -1.161049
H  2.549612 0.00125 -1.831004
H  -0.153241 1.405809 0.933022
H  -1.094905 0.108981 1.709872
H  -1.858797 -1.952456 0.285472
H  -1.410402 -2.029907 -1.435492
H  5.356229 -1.095026 1.129997
H  4.387693 0.236523 1.805956
H  3.541518 2.148548 0.166877
H  3.972881 2.045505 -1.556348
H  5.797671 1.096209 -0.074504
H  5.132989 -0.139533 -1.171418
H  -2.065055 2.066976 -0.478252
H  -2.598433 2.056542 1.225952
H  -3.850298 -1.347978 -1.08873
H  -2.900761 -0.130872 -1.984557
H  -6.286066 -0.175517 0.7813
