program: Gaussian 09
title: 000297515
version: EM64L-G09RevD.01
frameworkgroup: C1[X(C19H17BrOSi)]
method: RPBEPBE
basis: SDD
operation: Freq
keyword: #p
keyword: freq=noraman
keyword: PBEPBE/SDD
title: #p freq=noraman PBEPBE/SDD
converged: YES YES NO NO
title: Mulliken charges:
elementType: Br Si O C C C C C C C C C C C C C C C C C C C H H H H H H H H H H H H H H H H H
charge: 0.000556 1.491687 -0.587005 -0.231647 -0.204082 -0.218307 -0.279307 -0.291502 -0.319588 -0.323637 -0.300964 -0.304576 -0.195882 -0.188512 -0.496322 -0.241839 -0.245689 -0.236791 -0.236011 -0.206639 -0.229409 -0.229441 0.237402 0.285417 0.247884 0.247833 0.254122 0.250049 0.251808 0.251059 0.223869 0.229083 0.212781 0.229592 0.231015 0.229379 0.231309 0.230604 0.231702
chargesum: 0.00000
title: Mulliken charges with hydrogens summed into heavy atoms:
elementType: Br Si O C C C C C C C C C C C C C C C C C C C
charge: 0.000556 1.491687 -0.587005 -0.231647 -0.204082 -0.218307 -0.041905 -0.006084 -0.071705 -0.075804 -0.046843 -0.054527 0.055926 0.062547 0.169411 -0.012247 -0.014675 -0.007412 -0.004702 -0.206639 0.001196 0.002260
polarizability: 3.01884869e+02 9.43508383e+00 2.34389492e+02 1.56035695e+01 -1.35081451e+01 1.93702715e+02
1716.lowfreq: -7.8374 -5.4025 -2.2039 -0.0010 0.0007 0.0013 15.8367 21.7467 27.7788
frequency: 15.6607 21.7002 27.7033 40.2633 43.7715 54.5875 64.3823 82.1662 97.7937 119.1532 147.9917 158.2819 169.9690 186.7637 221.3311 233.3177 248.8246 277.8756 292.3922 338.0597 356.7073 391.9698 396.7694 398.3987 454.1136 455.4869 482.0027 517.8589 538.9446 614.1684 615.9311 619.3402 649.6000 695.8469 698.7553 708.0933 710.4052 715.7140 717.2780 750.5080 753.3652 819.6074 844.9799 863.7754 868.6200 930.5725 935.7580 955.7153 983.6831 986.8426 987.3936 987.8987 988.6091 993.6027 1001.7077 1003.0263 1022.3063 1024.0744 1037.3091 1054.9313 1073.8610 1077.6283 1096.6322 1102.6842 1105.3483 1108.3553 1124.3556 1147.0898 1173.6441 1174.7426 1191.6588 1195.6870 1200.3038 1293.7674 1310.3088 1315.5737 1343.3753 1365.6228 1367.2887 1374.3054 1418.4068 1421.0436 1442.9514 1459.1558 1469.6889 1470.9454 1473.1427 1474.6568 1563.2017 1574.8924 1576.0744 1577.4801 1597.3818 1597.6390 2941.5856 3025.4344 3083.2928 3111.9531 3114.4068 3116.5650 3118.3722 3119.3483 3129.9525 3130.8257 3142.5166 3143.4165 3144.9572 3159.8444 3160.4004 3165.6122 3169.4974
redmass: 3.7352 6.2985 4.3257 5.3281 5.0872 3.6807 3.6024 4.0433 6.4483 1.2712 2.9304 4.7230 8.5807 5.0674 5.5824 5.2582 5.5509 6.4096 4.8050 6.2424 6.7954 2.7694 2.8473 2.8334 6.2841 3.9866 3.8079 4.4551 7.8643 6.4940 6.4686 7.1104 7.6185 6.9285 6.0319 1.9422 2.0149 4.0427 4.8259 1.7128 1.8983 1.3953 1.2693 1.2451 1.2422 1.3485 1.3376 1.3380 1.4583 2.5779 2.2579 2.2953 1.8183 5.8910 1.3123 1.3106 3.1909 2.9081 6.9174 3.4810 1.7123 1.7104 2.6103 1.5156 2.8483 2.7005 1.2599 1.3608 1.0570 1.0575 1.1276 1.1288 1.1305 1.2479 1.4427 1.4231 4.2663 4.7484 5.2134 3.6067 2.1270 2.1364 1.1258 2.1332 2.0150 1.8785 1.0890 1.0556 7.3340 5.8395 5.5111 5.5776 5.7764 5.7601 1.0325 1.1030 1.0999 1.0872 1.0862 1.0875 1.0893 1.0872 1.0909 1.0911 1.0957 1.0957 1.0892 1.1014 1.1015 1.0949 1.0965
irintensity: 0.0995 0.0432 0.1440 0.1481 0.0412 1.1500 0.7051 1.0132 0.4370 1.6915 5.1904 4.5052 0.1074 0.9427 5.7415 4.0909 7.2073 0.2111 0.6954 25.7183 9.0863 0.0486 0.1345 0.0108 16.3713 3.1636 9.8483 145.9490 88.6463 1.2218 0.5983 3.1637 21.3869 31.8716 29.5794 71.4029 29.3251 150.1397 37.1921 4.5362 18.9641 32.2587 7.0641 0.3951 0.0408 0.1665 0.0768 0.1918 0.4052 1.5591 0.7582 1.2728 0.3200 84.1502 0.0887 0.0965 7.2089 2.0509 197.0787 31.5000 2.8038 0.8209 15.7839 6.3118 66.1451 34.3035 1.2200 14.2497 0.1976 0.5077 4.5998 5.9155 5.3723 2.1772 5.2110 4.4956 5.9391 1.1628 2.3550 11.0278 17.5971 18.2449 0.4858 56.2522 2.9605 11.1847 2.8841 8.6964 3.4727 53.7095 4.3944 0.6038 0.5461 1.1140 84.3498 50.6235 38.5972 10.7722 1.0439 0.4369 11.4796 0.7514 6.2932 3.0633 36.5789 38.4796 0.4757 48.8099 24.2352 7.6155 3.9878
temp: 298.150 k
press: 1.00000 atm
elementType: 35 14 8 6 6 6 6 6 6 6 6 6 6 6 6 6 6 6 6 6 6 6 1 1 1 1 1 1 1 1 1 1 1 1 1 1 1 1 1
symmnumber: 1
zpe: 787205.8 jmol-1
zpe.correction: 0.299831 hartree
zpe.thermalcorrener: 0.321286 hartree
zpe.thermalcorrenthalpy: 0.322230 hartree
zpe.thermalcorrgfe: 0.244654 hartree
zpe.sumelectzpe: -1110.783957 hartree
zpe.sumelectthermal: -1110.762502 hartree
zpe.sumelectthermalent: -1110.761558 hartree
zpe.sumelectthermalfe: -1110.839134 hartree
dipole: -3.9031 0.3903 -0.5306
dipole: 3.9582
quadrupole: -143.6149 -134.8325 -137.0188
quadrupole: 1.5441 2.3391 -2.8732
quadrupole: -5.1262 3.6562 1.4700 1.5441 2.3391 -2.8732
hfenergy: -1111.0837882 hartree
pointgroup: C01 [X(C19H17Br1O1Si1)]
dipole: -1.5406551 0.2260296 0.0212595 debye
polarizability: 304.2289958|2.2772111|222.7352804|-6.9363781|-23.8379146|203.0128009 unknown
InChI: InChI=1S/C19H17BrOSi/c1-21-22(17-8-4-2-5-9-17,18-10-6-3-7-11-18)19-14-12-16(20)13-15-19/h2-15H,1H3
charge 0 multiplicity 1
39 atoms
Br 6.231848 -0.651432 -1.374728
Si -0.106524 0.201987 0.607348
O  0.114829 0.560363 2.303599
C  1.687022 -0.035714 0.028207
C  -1.152893 -1.387043 0.474188
C  -0.954881 1.637742 -0.314182
C  1.992474 -0.407022 -1.308311
C  2.759162 0.146057 0.94062
C  -1.98931 -1.661781 -0.642029
C  -2.369429 1.796481 -0.278686
C  -1.061528 -2.36105 1.507386
C  -0.185256 2.619879 -0.997353
C  3.328765 -0.590808 -1.732689
C  4.102907 -0.033126 0.537045
C  -0.968925 0.994947 3.180434
C  -2.71148 -2.874825 -0.725943
C  -2.994313 2.897848 -0.906335
C  -1.785767 -3.571639 1.429486
C  -0.806658 3.720445 -1.63002
C  4.366851 -0.399227 -0.798006
C  -2.61145 -3.831685 0.310469
C  -2.213061 3.862231 -1.584681
H  1.189419 -0.563111 -2.039857
H  2.535096 0.430172 1.974467
H  -2.082379 -0.926418 -1.45134
H  -2.99049 1.053176 0.237595
H  -0.418407 -2.166315 2.375079
H  0.906868 2.524063 -1.037024
H  3.551628 -0.878076 -2.764318
H  4.921449 0.10982 1.248567
H  -1.389693 1.965704 2.849954
H  -0.538705 1.114017 4.188733
H  -1.785361 0.24474 3.222431
H  -3.349798 -3.071544 -1.594956
H  -4.084585 3.003058 -0.867618
H  -1.704273 -4.310716 2.234711
H  -0.196496 4.46473 -2.154239
H  -3.17145 -4.771787 0.246826
H  -2.695904 4.71606 -2.07383
